program: Gaussian 09
title: 000221623
version: EM64L-G09RevD.01
frameworkgroup: C1[X(C9H16O2)]
method: RPBEPBE
basis: SDD
operation: Freq
keyword: #pfreq=noraman
keyword: PBEPBE/SDD
title: #p freq=noraman PBEPBE/SDD
converged: YES YES NO NO
title: Mulliken charges:
elementType: O O C C C C C C C C C H H H H H H H H H H H H H H H H
charge: -0.301432 -0.298526 0.373012 -0.472801 -0.475061 -0.429859 -0.430453 -0.062163 -0.062257 -0.700227 -0.702266 0.230358 0.221961 0.230750 0.225789 0.220373 0.212429 0.219348 0.209999 0.220891 0.221129 0.206898 0.233380 0.233338 0.235017 0.233198 0.207175
chargesum: 0.00000
title: Mulliken charges with hydrogens summed into heavy atoms:
elementType: O O C C C C C C C C C
charge: -0.301432 -0.298526 0.373012 -0.020483 -0.018522 0.002943 -0.001106 0.158727 0.158872 -0.026611 -0.026875
polarizability: 1.17525240e+02 -4.56975970e-02 9.63869977e+01 1.19543180e-01 1.11385042e+00 8.28601481e+01
1716.lowfreq: -10.2090 -0.0009 -0.0004 0.0004 5.8127 13.4140 28.1086 46.6998 104.6960
frequency: 16.5459 46.6801 104.6830 196.2000 217.4095 229.5491 248.2743 261.5383 337.8409 345.6418 387.5682 395.3238 457.0888 508.8544 542.9407 674.6354 698.9263 714.4579 757.2694 788.2417 823.2566 849.9979 859.7057 880.8982 905.6831 931.7941 966.0777 992.8258 1016.5441 1016.6719 1046.4922 1052.4281 1077.2961 1095.2416 1113.2601 1137.2324 1145.0392 1167.7149 1176.4803 1218.3873 1230.4833 1266.2551 1267.6330 1284.3858 1302.9856 1307.3277 1316.2201 1318.8522 1351.9062 1384.2625 1384.5831 1443.8727 1448.9405 1461.7354 1465.5563 1469.3622 1473.2691 1474.3360 1479.7028 2982.0777 2982.5877 2995.2625 2997.5568 3013.5420 3016.8599 3034.9595 3036.0171 3060.0524 3068.3348 3076.8869 3080.0840 3090.5697 3094.5226 3096.9031 3098.6227
redmass: 2.4027 3.8879 2.9555 2.3871 1.2602 1.0117 1.8628 1.7301 2.9468 3.8408 2.5457 3.7484 4.1498 3.0047 1.9541 2.6727 2.9576 5.2116 2.9634 2.0900 1.9665 1.9644 3.3733 2.7822 2.4699 1.4760 1.8453 1.3796 1.5525 1.8634 1.9644 3.0316 1.8591 2.0911 1.7100 6.2308 2.2789 1.5214 1.9922 1.3973 1.3768 1.4930 1.2970 1.3441 1.3099 1.3853 1.2502 1.5762 1.5075 1.2316 1.2309 1.0831 1.0842 1.0456 1.0570 1.0840 1.0497 1.0484 1.0980 1.0362 1.0363 1.0607 1.0636 1.0620 1.0625 1.0870 1.0880 1.0983 1.1029 1.0981 1.0975 1.1036 1.1043 1.1008 1.1003
irintensity: 0.1014 4.2538 0.2238 0.0768 0.3601 0.0020 2.4053 0.0549 2.6803 0.8845 3.5262 1.7973 18.0398 1.7499 0.1884 2.7991 2.1118 2.6533 22.3889 3.3392 3.7194 6.8567 13.7370 21.8943 2.2480 16.3149 20.8299 17.3895 16.5911 84.7182 2.0233 37.0631 39.2850 1.6235 73.3402 29.7031 2.2973 10.9081 51.0725 4.1459 0.8088 0.4235 0.1984 1.0895 23.0195 0.6664 1.8111 30.6488 5.5884 35.4424 14.8673 8.3295 9.8960 19.0014 1.2936 8.9154 9.9942 3.7763 10.7810 26.7820 15.7736 42.0464 42.2021 22.3421 15.7053 22.2941 21.3118 29.4193 43.9877 5.9499 74.2161 6.9678 38.1886 8.1407 53.9392
temp: 298.150 k
press: 1.00000 atm
elementType: 8 8 6 6 6 6 6 6 6 6 6 1 1 1 1 1 1 1 1 1 1 1 1 1 1 1 1
symmnumber: 1
zpe: 617627.2 jmol-1
zpe.correction: 0.235242 hartree
zpe.thermalcorrener: 0.246594 hartree
zpe.thermalcorrenthalpy: 0.247538 hartree
zpe.thermalcorrgfe: 0.197215 hartree
zpe.sumelectzpe: -502.103615 hartree
zpe.sumelectthermal: -502.092263 hartree
zpe.sumelectthermalent: -502.091319 hartree
zpe.sumelectthermalfe: -502.141642 hartree
dipole: -1.0439 0.0506 -0.0138
dipole: 1.0452
quadrupole: -59.7994 -66.2127 -72.0539
quadrupole: -0.1201 0.1952 1.1826
quadrupole: 6.2226 -0.1907 -6.0319 -0.1201 0.1952 1.1826
hfenergy: -502.3388567 hartree
pointgroup: C01 [X(C9H16O2)]
dipole: -0.411215 0.0025508 -0.0020768 debye
polarizability: 117.4852931|0.8656214|92.1677338|0.3418037|6.3934877|87.1193587 unknown
InChI: InChI=1S/C9H16O2/c1-7-8(2)11-9(10-7)5-3-4-6-9/h7-8H,3-6H2,1-2H3
charge 0 multiplicity 1
27 atoms
O  -0.509397 -1.001068 0.754105
O  -0.516331 0.813054 -0.761347
C  0.385577 -0.069543 0.023058
C  1.365795 -0.804775 -0.932643
C  1.271734 0.7259 1.027581
C  2.73461 -0.109981 -0.731515
C  2.72597 0.248737 0.779495
C  -1.884436 -0.860465 0.205267
C  -1.905419 0.616653 -0.268923
C  -2.157354 -1.877498 -0.912023
C  -2.265903 1.621138 0.835025
H  0.996416 -0.778765 -1.970972
H  1.422178 -1.858487 -0.603129
H  0.923785 0.567874 2.061708
H  1.172612 1.798498 0.782424
H  3.586101 -0.752425 -1.017433
H  2.788153 0.814169 -1.338602
H  3.476608 1.013607 1.045799
H  2.940084 -0.657387 1.378534
H  -2.55862 -1.024655 1.064898
H  -2.549818 0.753459 -1.155687
H  -3.21937 -1.841415 -1.221102
H  -1.529488 -1.663791 -1.795358
H  -1.933599 -2.899659 -0.561149
H  -1.667584 1.432997 1.744228
H  -2.069564 2.651736 0.492395
H  -3.337537 1.541792 1.099465
