program: Gaussian 09
title: 000221611
version: EM64L-G09RevD.01
frameworkgroup: C1[X(C12H15NO6)]
method: RPBEPBE
basis: SDD
operation: Freq
keyword: #p
keyword: freq=noraman
keyword: PBEPBE/SDD
title: #p freq=noraman PBEPBE/SDD
converged: YES YES NO NO
title: Mulliken charges:
elementType: O O O O O O N C C C C C C C C C C C C H H H H H H H H H H H H H H H
charge: -0.308642 -0.290069 -0.303620 -0.283613 -0.449343 -0.215865 -0.423500 0.391634 0.043381 0.237833 0.292364 -0.519999 -0.562486 0.168791 -0.387103 -0.524428 -0.524098 -0.526552 0.179858 0.240847 0.297529 0.369542 0.281868 0.280944 0.233002 0.260178 0.229092 0.263818 0.215578 0.230314 0.227201 0.248742 0.232327 0.394477
chargesum: 0.00000
title: Mulliken charges with hydrogens summed into heavy atoms:
elementType: O O O O O O N C C C C C C C C C C C C
charge: -0.308642 -0.290069 -0.303620 -0.283613 -0.054865 -0.215865 -0.053958 0.391634 0.043381 0.237833 0.292364 -0.279152 -0.264957 0.168791 0.175709 0.197844 0.185611 0.181718 0.179858
polarizability: 2.32770048e+02 -3.79859091e+00 1.73839927e+02 -5.81647380e+00 2.06026055e+00 9.24065611e+01
1716.lowfreq: -5.7473 -3.2066 -0.0006 -0.0002 0.0006 5.8655 14.7432 36.0705 44.6210
frequency: 14.7314 36.0658 44.6027 60.8876 63.8550 74.7183 82.5180 99.7923 105.0255 140.4112 154.1321 160.3677 164.5068 168.6558 206.6928 226.9079 235.4267 250.0955 280.8742 287.7996 322.4880 363.9217 369.4606 423.3991 473.7266 491.0492 518.3241 537.3045 549.7651 567.3553 589.8132 616.9656 643.7504 649.3275 664.9348 742.1649 758.9055 775.2417 831.1391 864.5691 878.5840 902.7793 928.4905 939.8506 977.8449 989.9484 1035.7087 1071.4140 1077.4728 1110.6101 1113.3032 1114.2286 1125.9383 1149.1075 1154.1125 1158.7598 1176.8095 1202.7966 1208.7636 1245.9932 1289.5712 1305.4314 1336.8917 1359.1795 1390.9405 1415.7361 1434.5362 1436.1949 1449.4218 1456.9344 1458.1903 1459.0483 1461.6644 1477.3050 1484.4884 1486.3993 1495.3080 1556.2440 1592.9560 1604.8100 1685.3472 2974.8908 2977.0051 2981.9731 2987.0336 3026.0009 3072.4875 3083.7729 3085.1085 3123.7671 3125.9708 3128.9705 3152.4264 3175.4999 3533.3269 3565.5982
redmass: 5.4526 8.4229 4.8101 4.6393 4.7183 2.6281 3.3007 2.8013 2.3331 1.5188 1.5783 1.4551 2.8110 1.4623 3.4624 4.1446 6.8937 5.3567 6.3556 6.5595 4.3729 9.3161 5.4728 7.0099 4.5389 2.0781 5.8054 4.8094 4.7098 3.1821 1.4757 3.9808 2.6644 1.8178 6.0101 4.3361 6.6074 4.6640 5.0820 4.0210 2.0816 6.4741 1.5548 9.3784 2.0431 7.2033 6.3797 2.3281 2.1206 1.2384 1.2446 1.2548 3.7837 1.3919 1.3967 1.4521 2.9894 1.5028 1.0979 1.7807 2.6694 2.5568 2.0542 6.9705 2.8763 1.3399 1.2729 1.4104 1.6139 1.1156 1.0555 1.1005 1.1687 1.0584 1.0544 1.0708 2.3787 7.9423 8.2213 6.7098 9.2243 1.0307 1.0336 1.0296 1.0618 1.0973 1.1043 1.1047 1.0994 1.1027 1.1037 1.1046 1.0911 1.0922 1.0644 1.0779
irintensity: 1.0703 6.2321 1.7869 3.9883 1.3138 1.1621 3.2742 8.4077 2.6073 1.8416 1.0817 0.6355 4.3013 0.6865 7.2629 5.0649 7.6534 13.0175 5.0584 10.7831 3.2435 2.9917 2.6147 6.1309 30.0402 36.6876 0.6316 33.3442 31.5249 4.8347 27.1147 4.6370 40.3578 150.2371 27.1783 30.4085 1.5907 8.0906 23.3405 6.0983 19.4894 64.6720 28.6625 60.2174 1.3314 74.2466 150.1514 39.1379 218.9565 9.7665 11.2185 3.1699 9.7710 2.5747 2.3529 15.7693 42.0651 8.2407 0.3323 17.0892 114.8996 97.2599 135.5822 17.4687 36.8157 28.4945 41.7902 14.3486 206.5294 23.3394 8.7888 27.6889 42.7105 9.9398 15.4899 69.2206 318.6345 216.4847 45.0672 2.2425 284.8668 58.6312 100.3051 59.7803 28.0485 5.0466 25.6925 16.9111 32.8110 22.9262 21.4985 14.5282 4.5687 3.9594 32.4775 51.3468
temp: 298.150 k
press: 1.00000 atm
elementType: 8 8 8 8 8 8 7 6 6 6 6 6 6 6 6 6 6 6 6 1 1 1 1 1 1 1 1 1 1 1 1 1 1 1
symmnumber: 1
zpe: 680702.8 jmol-1
zpe.correction: 0.259266 hartree
zpe.thermalcorrener: 0.279911 hartree
zpe.thermalcorrenthalpy: 0.280855 hartree
zpe.thermalcorrgfe: 0.207439 hartree
zpe.sumelectzpe: -970.898635 hartree
zpe.sumelectthermal: -970.877989 hartree
zpe.sumelectthermalent: -970.877045 hartree
zpe.sumelectthermalfe: -970.950462 hartree
dipole: -3.5204 4.0796 -0.0304
dipole: 5.3887
quadrupole: -103.5833 -112.6946 -106.9145
quadrupole: 12.0459 4.0387 -0.4551
quadrupole: 4.1475 -4.9638 0.8163 12.0459 4.0387 -0.4551
hfenergy: -971.1579006 hartree
pointgroup: C01 [X(C12H15N1O6)]
dipole: 1.4980068 1.4112867 0.5088312 debye
polarizability: 233.0424506|-1.9884097|169.188814|5.1548716|18.4948407|96.785271 unknown
InChI: InChI=1S/C12H15NO6/c1-17-8-4-7(12(16)13-6-10(14)15)5-9(18-2)11(8)19-3/h4-5,13-14H,6H2,1-3H3
charge 0 multiplicity 1
34 atoms
O  3.688533 0.526481 0.273652
O  1.620548 2.420489 0.981964
O  2.880152 -2.120445 -0.560804
O  -2.212393 -2.155331 -0.259317
O  -4.412149 2.155487 -0.226994
O  -6.381787 0.923725 -0.355806
N  -2.814173 0.074952 -0.166133
C  -0.429801 -0.514708 0.009983
C  2.325917 0.157652 0.218288
C  1.327529 1.103141 0.591104
C  1.923083 -1.149324 -0.187136
C  -0.039363 0.762743 0.481222
C  0.560708 -1.4759 -0.302862
C  -1.867334 -0.934378 -0.143678
C  -4.229693 -0.26213 -0.293838
C  4.358578 0.567573 -1.052753
C  2.59216 2.602176 2.084831
C  3.782837 -2.558434 0.530415
C  -5.137613 0.95301 -0.294873
H  -0.761321 1.522567 0.79789
H  0.260628 -2.476433 -0.626248
H  -2.561359 1.063839 -0.16392
H  -4.55169 -0.933552 0.525753
H  -4.421693 -0.834525 -1.223793
H  3.89336 1.347451 -1.682667
H  4.291595 -0.41641 -1.549077
H  5.40726 0.825932 -0.841669
H  3.567538 2.159031 1.826921
H  2.198429 2.147532 3.01425
H  2.678151 3.692199 2.209521
H  3.197493 -3.050414 1.329708
H  4.34617 -1.703272 0.945065
H  4.467524 -3.284454 0.066738
H  -5.036923 2.929134 -0.238035
