program: Gaussian 09
title: 000221607
version: EM64L-G09RevD.01
frameworkgroup: C1[X(C10H7NO5)]
method: RPBEPBE
basis: SDD
operation: Freq
keyword: #p
keyword: freq=noraman
keyword: PBEPBE/SDD
title: #p freq=noraman PBEPBE/SDD
converged: YES YES NO NO
title: Mulliken charges:
elementType: O O O O O N C C C C C C C C C C H H H H H H H
charge: -0.248941 -0.240296 -0.173003 -0.212939 -0.205771 0.049251 0.264028 0.412601 -0.435556 -0.449359 0.362079 0.093208 -0.347185 0.282092 -0.303602 -0.772558 0.276472 0.312668 0.276312 0.297500 0.256828 0.256832 0.249339
chargesum: 0.00000
title: Mulliken charges with hydrogens summed into heavy atoms:
elementType: O O O O O N C C C C C C C C C C
charge: -0.248941 -0.240296 -0.173003 -0.212939 -0.205771 0.049251 0.264028 0.412601 -0.159084 -0.136691 0.362079 0.093208 -0.070873 0.282092 -0.006102 -0.009559
polarizability: 3.23989109e+02 1.32231053e+01 1.69472852e+02 -1.61564959e-03 -3.01822209e-03 5.62172874e+01
1716.lowfreq: -3.8965 -1.7473 0.0005 0.0006 0.0009 1.4956 45.5940 55.9158 56.4037
frequency: 45.5936 55.9082 56.4017 94.2086 139.3971 153.1826 164.1244 172.8031 196.5165 225.2513 278.6332 323.4304 343.7975 411.1510 473.6933 502.2192 543.5883 561.4939 592.0749 594.2502 646.2879 666.3574 677.8661 719.8608 729.4315 749.8711 809.0032 810.4158 855.1479 859.9473 902.7828 905.7252 915.1502 924.5257 954.6263 1000.3870 1029.2671 1042.1640 1125.9693 1145.9162 1179.4548 1208.3552 1229.9064 1261.6606 1295.3042 1335.1066 1349.3039 1390.8441 1403.9849 1446.8968 1454.6486 1487.2933 1539.2645 1594.6553 1638.6332 1704.0409 2986.8642 3063.3444 3116.3231 3135.3236 3230.0723 3241.7176 3259.4755
redmass: 6.6688 7.1829 10.9632 5.0342 1.3387 7.0798 3.4133 5.9983 4.0462 12.2408 3.7297 5.0587 4.9633 9.9821 4.3236 7.9031 5.7375 5.4222 6.9921 4.4114 6.1330 4.2402 7.1804 9.8720 4.2681 8.4886 1.3389 6.0421 1.3470 8.9118 1.3738 8.7612 1.4505 6.7456 3.1159 1.6550 1.2659 1.5376 3.0387 3.9023 2.2277 2.4402 3.5819 2.1809 4.9373 5.6891 5.1856 2.6608 1.2653 1.0437 1.1295 6.0412 6.3613 6.4862 8.6398 12.6751 1.0380 1.0966 1.0987 1.0897 1.0962 1.0994 1.1031
irintensity: 9.3926 3.7398 1.3751 0.8621 0.0548 0.2715 0.2882 1.7565 0.0322 3.1341 0.0351 7.7636 0.7295 1.2430 0.0409 1.3733 0.5607 0.9612 27.4037 0.5659 13.1005 0.3418 13.0411 35.0572 13.3428 10.6790 58.4273 45.9571 26.1775 40.4692 22.6242 7.1399 8.6682 0.1713 22.3375 18.0110 17.7258 11.5455 60.0988 157.6043 7.1135 122.1532 556.4202 31.9771 61.6311 121.8476 14.6697 76.1245 28.2684 17.5170 95.1563 124.1337 5.8435 232.4186 32.9396 445.8991 5.7090 6.0747 6.7933 0.6770 0.3614 5.7035 6.2538
temp: 298.150 k
press: 1.00000 atm
elementType: 8 8 8 8 8 7 6 6 6 6 6 6 6 6 6 6 1 1 1 1 1 1 1
symmnumber: 1
zpe: 406436.6 jmol-1
zpe.correction: 0.154804 hartree
zpe.thermalcorrener: 0.168654 hartree
zpe.thermalcorrenthalpy: 0.169598 hartree
zpe.thermalcorrgfe: 0.112822 hartree
zpe.sumelectzpe: -814.875924 hartree
zpe.sumelectthermal: -814.862074 hartree
zpe.sumelectthermalent: -814.861129 hartree
zpe.sumelectthermalfe: -814.917905 hartree
dipole: 0.4521 -1.5597 -0.0012
dipole: 1.6239
quadrupole: -114.6946 -85.0202 -90.8224
quadrupole: 30.3424 -0.0046 0.0023
quadrupole: -17.8489 11.8255 6.0233 30.3424 -0.0046 0.0023
hfenergy: -815.0307275 hartree
pointgroup: C01 [X(C10H7N1O5)]
dipole: 0.2032968 -0.6057 0.0005278 debye
dipolederiv: -0.5268679 -0.093875 -0.0001269 0.5919635 -1.1030081 0.0018632 -0.0012181 0.0009823 -0.1824344 -0.0164751 -0.0858013 0.0001775 -0.0764325 -0.445717 0.0004617 0.0001529 0.0004493 -0.0829112 -0.9554273 0.2513222 -0.0007218 0.9310337 -0.7719749 0.0011524 -0.002433 0.001221 -0.2971667 -1.3799212 0.1015058 -0.0008589 0.079664 -0.4100317 0.0003103 -0.0008735 0.000318 -0.2387265 -0.2848823 -0.1285184 0.0001464 0.4672401 -0.7940131 0.0011348 -0.0007261 0.0007782 -0.2229565 1.9214327 -0.2471292 0.0014423 -1.3499576 1.3873369 -0.0026224 0.0030562 -0.0018917 0.19946 -0.8475052 -0.0676274 -0.0006224 0.8934649 0.4244653 0.0001363 -0.0019386 -0.0005557 0.0564792 0.6967715 0.1397927 0.0002091 0.2381952 0.1200327 0.0001098 0.0000006 0.0000439 0.0933531 -0.1929019 -0.0646579 0.0000244 -0.3073357 -0.0745312 -0.0002912 0.000549 -0.0001168 -0.1214186 -0.8696156 -0.2393939 -0.0001152 -1.0200778 -0.5463057 -0.0002794 0.0007329 0.0001917 -0.2167269 1.6896376 0.1904821 0.0010282 -0.0370234 0.885963 -0.0012423 0.0013856 -0.0010738 0.0475562 1.5684752 0.1072312 0.0006863 -0.8844403 1.3465659 -0.0020817 0.0027825 -0.001529 0.2535481 -0.5791256 0.0792109 -0.0003876 -0.1824196 0.0343141 -0.0004206 -0.0000372 -0.0002438 -0.1804457 -0.7061457 0.1269108 -0.0007128 1.2452712 -0.3647523 0.0014887 -0.0022951 0.0007392 0.0942226 0.3031281 -0.043173 0.0003311 -0.3793391 0.2023754 -0.0007034 0.0008489 -0.0004865 -0.1155373 -0.2776528 -0.2500569 0.0000915 -0.1500056 -0.2647001 0.0003081 0.000129 0.0002927 0.0407354 0.041812 0.0042154 -0.0000857 0.0113374 0.024772 0.0001932 -0.0000827 0.0001876 0.1582847 0.0665276 0.0741187 -0.0002051 0.011287 0.0670655 0.0001925 -0.0000052 0.0002683 0.1923805 0.111425 0.0485734 -0.000121 0.0343607 0.0319662 0.0002537 -0.0001118 0.0002635 0.1957989 0.0744017 -0.0149697 -0.0000586 0.0173321 0.1440207 0.0000917 -0.0000978 0.0000664 0.2006087 0.0823396 -0.0047782 0.0914994 -0.0823256 0.0492845 -0.0050253 0.117134 0.040564 -0.0006691 0.0827186 -0.0049319 -0.091352 -0.0825501 0.0492346 0.0047839 -0.1168011 -0.040721 -0.0009021 -0.002149 0.1215495 -0.0002684 0.0307576 0.0076373 0.0001861 -0.0001514 0.0002518 0.1274676 unknown
polarizability: 322.6198523|19.609638|170.8417827|0.1571809|-0.1509551|56.2176135 unknown
InChI: InChI=1S/C10H7NO5/c1-6-4-7(10(12)15-6)5-8-2-3-9(16-8)11(13)14/h2-5H,1H3
charge 0 multiplicity 1
23 atoms
O  3.769549 0.484643 -0.003064
O  -1.307637 -0.022837 -0.00616
O  3.672159 -1.869398 0.0004
O  -4.791425 0.798241 -0.009536
O  -2.919904 2.144248 -0.010356
N  -3.50521 0.988979 -0.008977
C  1.601997 -0.462531 -0.0037
C  -0.755817 -1.330508 -0.003959
C  0.662777 -1.481127 -0.002831
C  1.493534 0.981338 -0.005912
C  2.771041 1.504936 -0.00545
C  3.066127 -0.789184 -0.002363
C  -1.811593 -2.266965 -0.003292
C  -2.693762 -0.191108 -0.0068
C  -3.040319 -1.542224 -0.005094
C  3.290672 2.898444 -0.006862
H  1.035747 -2.512834 -0.001115
H  0.571703 1.55709 -0.007495
H  -1.692064 -3.348594 -0.001689
H  -4.053942 -1.933844 -0.005176
H  3.924603 3.077549 -0.895202
H  3.923169 3.079878 0.882025
H  2.461192 3.622607 -0.008491
