program: Gaussian 09
title: 000221606
version: EM64L-G09RevD.01
frameworkgroup: C1[X(C9H12N4O5)]
method: RPBEPBE
basis: SDD
operation: Freq
keyword: #p
keyword: freq=noraman
keyword: PBEPBE/SDD
title: #p freq=noraman PBEPBE/SDD
converged: YES YES NO NO
title: Mulliken charges:
elementType: O O O O O N N N N C C C C C C C C C H H H H H H H H H H H H
charge: -0.443897 -0.226153 -0.272052 -0.223834 -0.207760 -0.145339 -0.015339 -0.621911 0.048551 -0.019196 -0.414944 -0.695518 0.321010 0.353938 -0.336439 -0.324239 0.268966 -0.303440 0.208374 0.225621 0.285488 0.219287 0.242030 0.218801 0.348454 0.245875 0.272918 0.293494 0.343104 0.354150
chargesum: 0.00000
title: Mulliken charges with hydrogens summed into heavy atoms:
elementType: O O O O O N N N N C C C C C C C C C
charge: -0.095442 -0.226153 -0.272052 -0.223834 -0.207760 -0.145339 -0.015339 0.075343 0.048551 0.189178 0.096166 -0.015401 0.321010 0.353938 -0.090564 -0.051321 0.268966 -0.009946
polarizability: 3.48616052e+02 2.04732191e+01 1.56045299e+02 1.19872586e+01 -1.59150452e+01 8.32158036e+01
1716.lowfreq: -5.0299 -2.8675 0.0006 0.0007 0.0009 6.0544 25.5051 29.1055 39.5883
frequency: 25.3943 29.1032 39.5704 56.0982 68.9097 82.1595 94.9404 127.3069 151.5164 185.8093 213.1939 227.3822 245.1918 254.2327 267.3322 313.0868 332.4826 357.2067 384.6067 427.1505 444.9489 451.7882 462.1496 520.5332 533.1376 560.7429 577.9290 609.2322 620.3515 654.7856 676.1824 709.7753 728.3760 744.0986 807.0426 810.5764 837.9386 891.6064 896.1118 905.3241 917.0125 922.3290 946.3493 1015.3498 1032.4020 1052.4339 1070.0620 1087.8990 1130.8071 1144.9806 1160.2554 1207.4246 1223.8945 1235.2993 1268.3558 1285.5877 1312.5624 1330.9977 1338.0537 1353.4457 1373.1077 1378.5375 1385.6210 1391.5651 1443.8418 1468.2660 1473.7198 1497.1002 1544.5475 1549.8680 1580.7991 1683.8358 2951.0422 2979.7744 3001.1755 3072.0064 3087.5830 3091.2371 3093.8171 3240.6356 3259.6668 3533.4551 3569.7425 3702.5251
redmass: 3.8418 6.4888 6.0572 8.9788 4.7152 6.0035 6.9231 7.5586 7.4407 7.2915 1.3983 2.3042 4.8181 1.7725 2.0540 3.3454 3.4290 3.6730 4.3908 4.5669 3.4415 4.2900 2.6270 5.8073 1.2332 5.6768 4.1869 5.9862 1.1002 4.2185 8.7192 9.7986 9.8487 5.5424 2.9060 1.3870 4.2500 1.7988 1.4533 1.3790 4.6584 2.3169 4.0658 1.3685 1.9358 2.1179 1.7249 3.0522 5.2896 2.5121 3.5988 3.6826 1.9154 1.3811 5.7579 1.2341 1.4296 1.8175 7.3250 1.9670 3.5800 2.2437 1.3824 1.3032 1.1018 1.0594 1.0666 8.1601 4.9248 1.2771 7.1319 7.8067 1.0836 1.0366 1.0639 1.0986 1.0986 1.0905 1.0965 1.0944 1.1046 1.0452 1.0664 1.1040
irintensity: 4.9614 4.6212 2.6074 0.9294 4.8166 2.8712 2.3445 0.5945 2.8248 2.1496 8.6251 6.1599 4.7695 68.1442 75.4502 5.2775 10.0220 6.9395 14.4487 4.5177 6.7894 11.5892 24.9445 3.7553 178.5949 0.6143 44.3845 1.2443 88.1357 2.1215 13.1601 36.5212 27.9253 10.1937 11.0415 81.9539 18.0273 20.6881 39.3899 0.1716 21.9435 3.1697 2.7853 127.5834 57.7771 42.0057 82.8424 28.3581 171.4789 3.6788 6.4132 155.1715 427.1148 20.1994 397.1733 12.5083 17.8220 59.4727 117.2473 351.1671 329.1345 188.1003 47.1381 28.4899 40.3123 14.3272 6.6833 78.9422 152.9175 182.0861 210.0546 306.0212 43.7064 16.9558 24.4177 31.3871 15.3242 26.3035 2.5679 0.2352 4.4557 28.7533 5.0646 105.5458
temp: 298.150 k
press: 1.00000 atm
elementType: 8 8 8 8 8 7 7 7 7 6 6 6 6 6 6 6 6 6 1 1 1 1 1 1 1 1 1 1 1 1
symmnumber: 1
zpe: 578479.8 jmol-1
zpe.correction: 0.220331 hartree
zpe.thermalcorrener: 0.238406 hartree
zpe.thermalcorrenthalpy: 0.239350 hartree
zpe.thermalcorrgfe: 0.171916 hartree
zpe.sumelectzpe: -943.796731 hartree
zpe.sumelectthermal: -943.778656 hartree
zpe.sumelectthermalent: -943.777712 hartree
zpe.sumelectthermalfe: -943.845147 hartree
dipole: -3.9586 -1.3648 1.3682
dipole: 4.4051
quadrupole: -157.7167 -86.2651 -101.5860
quadrupole: -21.5966 -1.6717 -1.1341
quadrupole: -42.5274 28.9242 13.6032 -21.5966 -1.6717 -1.1341
hfenergy: -944.0170624 hartree
pointgroup: C01 [X(C9H12N4O5)]
dipole: -1.578231 0.4806444 -0.5309062 debye
polarizability: 349.1532803|-16.2109212|154.063322|-14.8836471|-18.1778081|84.6605524 unknown
InChI: InChI=1S/C9H12N4O5/c1-6(14)5-12(9(10)15)11-4-7-2-3-8(18-7)13(16)17/h2-4,6,14H,5,10H2,1H3
charge 0 multiplicity 1
30 atoms
O  -3.480776 -1.445925 -1.444443
O  2.300992 -0.472703 0.148438
O  -4.588313 1.156132 0.530637
O  5.799329 0.108247 -0.389468
O  4.679747 -1.776401 0.32317
N  -2.360138 0.414589 0.349271
N  -1.088895 0.814936 0.06445
N  -2.966747 2.586709 -0.368759
N  4.717421 -0.544006 -0.072866
C  -2.674453 -2.000854 -0.345803
C  -2.74982 -0.942818 0.779793
C  -3.220165 -3.349811 0.15423
C  -3.406277 1.406318 0.175378
C  1.270809 0.475478 -0.047795
C  -0.057845 -0.001799 0.236685
C  1.831717 1.68747 -0.489999
C  3.492953 0.184396 -0.181763
C  3.244464 1.499278 -0.574481
H  -1.626097 -2.136165 -0.68964
H  -2.124418 -1.256736 1.637914
H  -3.796724 -0.852398 1.113513
H  -3.158654 -4.118295 -0.638542
H  -4.277448 -3.247602 0.456576
H  -2.639913 -3.721077 1.019623
H  -3.545471 -2.112451 -2.17392
H  -0.129632 -1.036368 0.600583
H  1.273689 2.591765 -0.718119
H  4.000985 2.217862 -0.878374
H  -3.645944 3.328236 -0.511946
H  -1.983074 2.694599 -0.611743
