program: Gaussian 09
title: 000221602
version: EM64L-G09RevD.01
frameworkgroup: C1[X(C9H8ClN3O5)]
method: RPBEPBE
basis: SDD
operation: Freq
keyword: #p
keyword: freq=noraman
keyword: PBEPBE/SDD
title: #p freq=noraman PBEPBE/SDD
converged: YES YES NO NO
title: Mulliken charges:
elementType: Cl O O O O O N N N C C C C C C C C C H H H H H H H H
charge: -0.008810 -0.218190 -0.168912 -0.222924 -0.213337 -0.200081 -0.228524 0.065938 0.050739 0.002590 -0.412737 -0.616300 0.284355 -0.334218 0.360193 -0.306441 0.273852 -0.298799 0.281331 0.257513 0.263327 0.282614 0.266668 0.247072 0.296419 0.296661
chargesum: 0.00000
title: Mulliken charges with hydrogens summed into heavy atoms:
elementType: Cl O O O O O N N N C C C C C C C C C
charge: -0.008810 -0.218190 -0.168912 -0.222924 -0.213337 -0.200081 -0.228524 0.065938 0.050739 0.283922 0.108103 -0.067018 0.284355 -0.087146 0.360193 -0.010022 0.273852 -0.002138
polarizability: 3.57605872e+02 -2.10599009e+01 1.51138822e+02 6.81967648e+00 3.70930943e+00 6.88611357e+01
1716.lowfreq: -10.0638 -3.9065 -2.9054 -0.0010 -0.0006 0.0009 22.4594 34.5644 37.2179
frequency: 22.4190 34.5486 37.1736 56.4012 78.1941 89.8290 120.0041 143.5518 155.9221 167.9399 197.6324 213.6562 259.6750 313.1221 324.1500 374.1685 387.4018 414.2557 453.7477 532.8893 557.1597 563.0426 630.3192 640.5941 652.3731 671.4387 680.6125 707.5179 724.8701 738.3740 813.6906 828.0743 847.7096 897.8406 912.2320 915.5025 918.9557 945.2864 992.5930 1006.4658 1020.6567 1046.2681 1098.4061 1132.9844 1157.1966 1160.2855 1168.6848 1194.3016 1208.0772 1224.0645 1262.3444 1266.9608 1309.7299 1329.4352 1343.8985 1360.0037 1366.6610 1380.2291 1430.8180 1481.8529 1496.4096 1551.9395 1583.0199 1743.2301 2968.5537 3039.2899 3048.5121 3059.9919 3062.7079 3135.3324 3241.6149 3260.3749
redmass: 7.0805 8.7269 8.5666 9.1734 7.4643 6.4426 5.3580 9.4012 7.4761 9.5144 3.2528 6.5102 9.5158 3.1168 5.8263 7.5289 4.6729 4.1800 9.3680 8.0595 5.2989 5.7859 4.3635 9.9012 4.6231 11.2494 8.8022 5.4212 7.9781 9.3722 4.9978 1.2989 4.0030 1.5205 1.4608 1.4773 7.5840 4.9183 8.0732 2.2482 1.2646 2.8268 2.1130 5.5583 1.2910 3.9919 3.7747 3.6710 1.3050 1.7386 4.9172 1.2267 1.2728 1.4436 9.0337 1.4915 3.6279 2.6449 1.1029 1.1047 7.5340 6.1836 7.0358 12.7611 1.0626 1.0973 1.0588 1.0900 1.0886 1.1094 1.0953 1.1045
irintensity: 0.4656 8.9796 10.3025 1.7730 2.5391 2.3655 2.0003 0.7707 2.0684 3.4330 1.0532 0.0267 1.0932 10.0074 2.7513 0.4661 3.3896 3.9224 3.9363 6.1457 5.6323 0.6065 1.0339 19.2984 0.0904 13.8881 14.8987 47.5339 8.0616 10.0291 26.9759 58.7229 12.3795 46.8285 30.5659 22.1038 9.9839 0.4820 403.5777 114.1622 55.8129 34.9500 29.5676 178.2445 39.6941 195.9993 73.5918 151.5634 1.7450 331.4644 408.7874 7.3587 4.7119 36.7425 89.7838 18.3700 249.3650 89.7960 11.6450 51.7742 51.1288 64.2434 92.2880 518.6695 21.2201 3.8074 12.0081 16.9558 27.1620 6.2838 0.3166 6.8143
temp: 298.150 k
press: 1.00000 atm
elementType: 17 8 8 8 8 8 7 7 7 6 6 6 6 6 6 6 6 6 1 1 1 1 1 1 1 1
symmnumber: 1
zpe: 455509.1 jmol-1
zpe.correction: 0.173494 hartree
zpe.thermalcorrener: 0.189890 hartree
zpe.thermalcorrenthalpy: 0.190834 hartree
zpe.thermalcorrgfe: 0.126009 hartree
zpe.sumelectzpe: -1346.720411 hartree
zpe.sumelectthermal: -1346.704015 hartree
zpe.sumelectthermalent: -1346.703071 hartree
zpe.sumelectthermalfe: -1346.767897 hartree
dipole: -3.0640 -2.5494 -0.2261
dipole: 3.9923
quadrupole: -163.2054 -120.1893 -105.9699
quadrupole: 33.5498 0.6960 -0.6710
quadrupole: -33.4172 9.5989 23.8183 33.5498 0.6960 -0.6710
hfenergy: -1346.8939056 hartree
pointgroup: C01 [X(C9H8Cl1N3O5)]
dipole: 1.1457792 1.072784 -0.0587255 debye
dipolederiv: -0.6241707 -0.0848904 -0.0112252 -0.0603254 -0.1451149 -0.0110301 0.0461409 -0.0074755 -0.1557643 -1.3775472 -0.4388886 0.05375 -0.6342482 -0.908869 0.0329127 0.0253771 0.0290591 -0.2873167 -0.6016059 -0.0422299 0.0063648 0.5038708 -1.2190415 0.0529687 -0.0320908 0.0940652 -0.3113848 0.0867477 -0.1139061 0.0009593 0.0002307 -0.5364429 0.0155215 -0.0046933 0.0187418 -0.0879239 -1.278002 -0.0310445 0.0248862 -0.2607076 -0.4598729 0.0137801 0.036995 0.0082669 -0.2403239 -0.500614 0.0464605 0.0048478 0.5284734 -0.876539 0.0117295 -0.0105739 0.020884 -0.2244009 -2.6954422 0.3947239 0.0143293 0.4035827 -0.461021 0.0174749 0.0658846 0.0317466 -0.1757015 1.6985605 -0.2010645 -0.0356489 0.0932376 -0.2360188 0.0025129 -0.0681592 0.0116543 -0.069231 2.4084384 -0.3487507 -0.0389862 -0.8965317 1.344316 -0.0203474 -0.0283547 -0.0290629 0.2101712 0.2362347 -0.0057199 -0.000631 0.5094448 0.6306995 -0.0552699 -0.0090293 -0.044254 0.3004784 -0.1154754 0.0446827 0.0148797 0.0349097 0.2013509 0.0248321 -0.0535769 0.0236657 0.3282564 0.8415995 0.0579707 -0.0746152 0.008511 0.1085126 -0.0104455 -0.0644898 -0.0494754 0.1230601 2.7515406 0.1198844 -0.0461935 -1.2237551 1.9908584 -0.1175561 0.0735858 -0.1537784 0.3084265 -0.3980798 0.1025996 -0.0030402 0.7020269 0.216429 -0.0208754 -0.0239519 -0.014533 -0.1110471 0.6234153 0.0173162 -0.0108903 0.3907183 0.1816535 -0.0134262 -0.0316247 -0.0058822 0.0583443 -0.5585829 0.0265845 0.0070855 -0.4799403 0.0224196 0.0043695 0.0275771 -0.0073973 -0.1605358 -1.1781523 0.4018697 0.0115935 0.9050052 -0.1157043 -0.015209 0.0032496 -0.0040926 0.0784034 0.4479272 -0.0708019 -0.0112091 -0.3154694 0.120202 -0.0001427 -0.0048061 -0.0057683 -0.1050276 0.0596996 0.014534 0.0292597 -0.0688833 -0.0152413 0.0105397 0.0367439 0.0520646 -0.0667279 0.0833047 0.0302593 0.0355305 -0.0998088 -0.0219642 -0.0408287 -0.0045257 -0.0947327 -0.0644913 0.0244251 0.0581728 -0.0656304 -0.038587 -0.0053619 0.0368363 -0.0396707 0.0639754 -0.0103312 -0.041592 -0.0232646 0.0652846 0.0058112 0.0905507 0.0588416 0.0552028 0.0249609 -0.0323014 -0.0807296 0.0540401 0.0177839 0.0292061 -0.0580447 0.0071766 -0.0092227 0.0196887 0.1002473 0.0222775 -0.029223 0.0062885 -0.0820663 -0.06507 0.0099335 0.0090262 0.0117765 0.2050939 0.0889559 0.0570371 0.0008346 0.0521519 0.0914609 0.002724 0.0012391 0.0025185 0.1925706 0.0768675 -0.0363515 0.004392 -0.0068572 0.1258535 0.0029774 0.0037477 0.0033839 0.1974571 unknown
polarizability: 359.3902759|-8.8511919|149.5513073|-5.768323|-2.1627585|68.6642462 unknown
InChI: InChI=1S/C9H8ClN3O5/c10-3-7-5-12(9(14)18-7)11-4-6-1-2-8(17-6)13(15)16/h1-2,4,7H,3,5H2
charge 0 multiplicity 1
26 atoms
Cl 6.582777 1.620951 0.209446
O  4.188134 -0.608893 -0.006167
O  2.881507 -2.547918 0.168023
O  -2.702254 0.635879 0.05271
O  -6.240025 0.076436 0.168578
O  -5.028503 2.032949 0.069166
N  1.918707 -0.363397 -0.047073
N  0.626054 -0.794369 0.009435
N  -5.125655 0.743986 0.115656
C  3.933946 0.837994 -0.283339
C  2.40156 1.033113 -0.078571
C  4.76637 1.698223 0.657284
C  2.970549 -1.325944 0.047142
C  -0.349931 0.100048 0.006609
C  -1.712343 -0.371525 0.06014
C  -2.322625 -1.634172 0.12093
C  -3.925946 -0.039472 0.109887
C  -3.735402 -1.420018 0.152541
H  4.222518 1.014379 -1.333721
H  2.159167 1.550423 0.872184
H  1.952014 1.59874 -0.914261
H  4.683494 1.351896 1.698313
H  4.47909 2.758558 0.571387
H  -0.215588 1.193171 -0.033373
H  -1.791352 -2.582571 0.139414
H  -4.52606 -2.164066 0.200259
