program: Gaussian 09
title: 000221600
version: EM64L-G09RevD.01
frameworkgroup: C1[X(C8H10N4O4)]
method: RPBEPBE
basis: SDD
operation: Freq
keyword: #p
keyword: freq=noraman
keyword: PBEPBE/SDD
title: #p freq=noraman PBEPBE/SDD
converged: NO YES NO NO
title: Mulliken charges:
elementType: O O O O N N N N C C C C C C C C H H H H H H H H H H
charge: -0.223519 -0.294118 -0.222035 -0.203800 -0.164003 -0.006637 -0.373342 0.049143 0.369390 -0.322672 0.270847 -0.302662 -0.354030 0.340618 -0.651778 -0.604707 0.272988 0.294031 0.260159 0.243932 0.295457 0.243942 0.346159 0.231408 0.273925 0.231302
chargesum: 0.00000
title: Mulliken charges with hydrogens summed into heavy atoms:
elementType: O O O O N N N N C C C C C C C C
charge: -0.223519 -0.294118 -0.222035 -0.203800 -0.164003 -0.006637 -0.027183 0.049143 0.369390 -0.049684 0.270847 -0.008631 -0.093871 0.340618 0.131554 0.131929
polarizability: 3.40287022e+02 1.28307274e+01 1.44192466e+02 8.35033617e-02 -1.20176854e-01 6.16622718e+01
1716.lowfreq: -5.7347 0.0007 0.0009 0.0011 5.3503 5.6542 29.2464 50.7305 52.5971
frequency: 29.2086 50.7204 52.5957 80.7657 96.8661 117.7854 127.0611 132.9720 179.4791 215.2912 219.3874 237.5083 248.5198 294.2639 344.2293 368.3161 390.2428 422.6861 446.8788 510.4305 561.5384 576.0324 630.4084 654.7740 676.9321 688.9402 705.8009 732.5242 782.8599 811.8770 837.4199 896.8294 905.5125 917.7319 944.7761 966.1413 1019.8096 1058.0335 1114.2728 1127.1125 1132.4220 1149.7656 1161.2031 1180.8725 1211.1404 1240.3222 1262.3453 1271.5224 1340.4465 1356.3834 1374.9555 1417.2528 1429.0202 1462.3970 1473.7591 1483.4223 1486.3020 1497.5145 1517.6836 1545.3139 1583.0798 1669.3361 2974.3042 2982.1619 3055.4685 3060.8506 3094.3505 3114.3265 3129.3986 3239.7204 3259.2255 3524.0060
redmass: 5.7506 8.4616 5.7774 4.2024 1.2003 4.3242 3.5438 6.3322 5.3880 2.2912 5.0634 5.4679 1.5366 4.6633 2.6232 4.4850 6.5891 5.5402 8.1903 7.9361 5.7199 5.5436 5.3314 4.2843 8.4862 1.5086 3.0110 12.5028 4.3651 1.3257 4.3948 1.4613 1.3816 7.2217 4.8002 2.9082 1.2758 3.1083 1.3082 1.2851 5.5965 1.6130 3.6730 2.4166 2.0183 2.7084 3.2800 7.0454 10.6608 2.1788 3.6818 1.2492 1.1702 1.2601 1.1902 1.0440 1.0437 4.9464 1.5072 5.5844 6.8264 8.9488 1.0355 1.0353 1.1022 1.1025 1.0881 1.0984 1.0972 1.0946 1.1045 1.0765
irintensity: 2.2816 1.7507 3.2769 0.6417 0.0776 11.2788 6.7439 4.3051 0.0425 0.0384 5.9331 0.1425 0.6891 12.8878 8.1577 25.4153 0.0850 8.5920 19.4325 4.0517 0.3789 6.1012 2.0719 0.0043 8.2618 43.7812 88.6127 12.6131 8.2918 66.4299 15.7815 42.6240 0.0252 17.1758 1.2974 32.5989 75.5070 341.9821 0.1688 0.0019 187.0528 36.2927 64.8617 158.3339 1.6292 473.0166 16.4428 408.4939 107.2944 204.2072 27.1912 96.0122 15.4255 222.9993 251.3695 16.8983 21.1540 49.9823 374.6248 57.1610 136.9969 258.9599 29.7981 78.2348 22.9510 35.2225 12.3105 2.7664 2.1891 0.3236 4.4266 47.1247
temp: 298.150 k
press: 1.00000 atm
elementType: 8 8 8 8 7 7 7 7 6 6 6 6 6 6 6 6 1 1 1 1 1 1 1 1 1 1
symmnumber: 1
zpe: 495581.8 jmol-1
zpe.correction: 0.188757 hartree
zpe.thermalcorrener: 0.204466 hartree
zpe.thermalcorrenthalpy: 0.205410 hartree
zpe.thermalcorrgfe: 0.144043 hartree
zpe.sumelectzpe: -829.434608 hartree
zpe.sumelectthermal: -829.418899 hartree
zpe.sumelectthermalent: -829.417955 hartree
zpe.sumelectthermalfe: -829.479322 hartree
dipole: -4.9894 2.8985 -0.0075
dipole: 5.7702
quadrupole: -141.9576 -80.6295 -92.9179
quadrupole: -1.3375 -0.1328 0.0122
quadrupole: -36.7893 24.5388 12.2504 -1.3375 -0.1328 0.0122
hfenergy: -829.6233651 hartree
pointgroup: C01 [X(C8H10N4O4)]
dipole: 1.9383275 -1.1745845 0.1301838 debye
dipolederiv: 0.0087755 0.0081074 0.0025956 0.2019776 -0.4984715 0.0296883 -0.0091484 0.0242546 -0.0930065 -1.4698169 -0.2968736 -0.0109332 -0.0854575 -0.7553676 0.0243636 -0.0284655 0.0160143 -0.3745579 -1.2309949 -0.1721101 -0.0187633 -0.5058182 -0.5650103 0.0038175 0.0023982 0.0142468 -0.2474197 -0.661093 0.1191375 -0.0197324 0.6618182 -0.7558079 0.0510724 -0.0509888 0.0343282 -0.2306318 -2.7325949 0.1496314 -0.087516 -0.175984 -0.4162342 0.0122879 -0.0650378 0.0214267 -0.1628922 1.7812986 0.2005079 0.0424182 0.6165597 -0.3334365 0.0345736 0.0129416 0.0216153 -0.087626 -0.6300182 0.1198582 -0.0126495 0.6939996 -1.1476792 0.0663104 -0.0516061 0.0500031 -0.4794076 2.7288669 -0.1142024 0.0805297 -0.6133461 1.1448703 -0.0737039 0.1079397 -0.059053 0.2132599 0.79346 0.1260335 0.0133026 0.7453513 0.3204348 0.0075356 -0.0236343 -0.010574 0.0742374 -0.5221244 -0.0561189 -0.006609 -0.7259556 -0.1236091 -0.0247936 0.0333222 -0.0052535 -0.1872041 -1.4891526 0.1589908 -0.0549664 0.6633094 0.1005714 0.0177121 -0.0843358 0.0030523 0.0688248 0.6193254 -0.0054531 0.0215812 -0.2734802 0.050512 -0.0172036 0.0371 -0.0093975 -0.1053823 -0.9913374 -0.0978499 -0.018707 0.4332624 0.281943 -0.0133186 -0.0522082 -0.0290806 -0.1400137 2.7289164 0.0657895 0.0670487 -1.3099562 1.5620206 -0.1290348 0.1587837 -0.08569 0.2730313 -0.0524215 -0.0063681 -0.0085882 0.1527341 0.3046558 0.0013504 -0.0173727 -0.0040244 0.2517777 0.4102596 -0.3631656 0.0294799 -0.2752789 0.3370353 -0.0128473 0.0235225 -0.0148997 0.2707986 0.0441591 0.0730452 -0.0085115 0.0535265 0.0808571 0.0079685 -0.0072829 0.0085779 0.1901961 0.0882477 -0.0462297 -0.0004931 -0.0171349 0.1035671 0.0049937 -0.0022507 0.004176 0.1972216 0.0237352 0.0093485 -0.0059866 -0.0317769 -0.0569805 0.0152773 -0.0027702 0.0166307 0.2050005 0.0774151 0.0876497 -0.1063168 -0.0462834 0.0008773 0.0086342 -0.0374663 0.0686944 -0.0604958 0.0455456 -0.1196117 0.0051983 -0.024124 0.1761021 -0.0032042 -0.0010009 -0.0057574 0.1409745 0.0693469 0.1045524 0.1008702 -0.0393939 -0.0100187 -0.0171886 0.0500587 -0.0692051 -0.0417421 0.2791155 -0.0537298 0.0017726 -0.1598501 0.2051741 0.0043287 0.0092637 0.0072666 0.3372785 0.0377554 0.0533893 0.0346396 0.1078339 -0.0321333 0.1041875 -0.0443305 0.1474698 -0.0899497 0.0056604 -0.0009507 -0.0034874 -0.1661693 0.0934153 -0.0019358 0.0077755 0.0027995 0.1322928 0.0376705 0.0566225 -0.0361762 0.1196365 -0.0672874 -0.1008714 0.0347934 -0.1476208 -0.0545642 unknown
polarizability: 340.4861229|9.2903728|143.4648914|7.6980665|-4.8193387|62.1907456 unknown
InChI: InChI=1S/C8H10N4O4/c1-9-8(13)11(2)10-5-6-3-4-7(16-6)12(14)15/h3-5,9H,1-2H3
charge 0 multiplicity 1
26 atoms
O  -2.12247 0.706254 -0.159766
O  4.962028 0.741633 0.043942
O  -5.431398 -0.676195 -0.174006
O  -4.716592 1.511654 -0.283045
N  2.613177 0.865129 -0.033298
N  1.458597 0.138149 -0.020861
N  3.690596 -1.233526 0.140276
N  -4.504574 0.2376 -0.202376
C  -0.922695 -0.036715 -0.081061
C  -1.227564 -1.407843 -0.009293
C  -3.157097 -0.236446 -0.134582
C  -2.649683 -1.532124 -0.043645
C  0.283544 0.750598 -0.09322
C  3.859807 0.123232 0.050869
C  2.662437 2.332592 -0.125732
C  4.828999 -2.14939 0.237114
H  -0.498796 -2.21135 0.058614
H  -3.246211 -2.439861 -0.008032
H  0.151152 1.839543 -0.164073
H  2.196181 2.682624 -1.065994
H  3.724661 2.616527 -0.114236
H  2.146115 2.798305 0.734846
H  2.725624 -1.573829 0.134812
H  4.796173 -2.72809 1.178618
H  5.753877 -1.551599 0.221752
H  4.84741 -2.853573 -0.61502
