program: Gaussian 09
title: 000221599
version: EM64L-G09RevD.01
frameworkgroup: C1[X(C8H9N3O5)]
method: RPBEPBE
basis: SDD
operation: Freq
keyword: #pfreq=noraman
keyword: PBEPBE/SDD
title: #p freq=noraman PBEPBE/SDD
converged: NO YES NO NO
title: Mulliken charges:
elementType: O O O O O N N N C C C C C C C C H H H H H H H H H
charge: -0.223296 -0.303879 -0.217556 -0.201132 -0.220580 0.050063 -0.377952 0.071431 0.385010 -0.310607 0.274676 -0.300847 -0.224389 -0.369043 -0.669141 0.329241 0.295148 0.295379 0.235048 0.235024 0.246537 0.218348 0.231511 0.231511 0.319495
chargesum: 0.00000
title: Mulliken charges with hydrogens summed into heavy atoms:
elementType: O O O O O N N N C C C C C C C C
charge: -0.223296 -0.303879 -0.217556 -0.201132 -0.220580 0.050063 -0.058458 0.071431 0.385010 -0.015459 0.274676 -0.005468 0.245683 -0.122506 0.012229 0.329241
polarizability: 3.47244397e+02 -5.25665594e+00 1.27019845e+02 6.27804515e-03 6.25701399e-03 5.99086043e+01
1716.lowfreq: -38.0486 -5.4460 -2.4086 -0.0008 -0.0006 0.0003 14.6522 33.7653 39.1452
frequency: -31.5446 33.6923 39.1452 56.1678 73.3074 103.6976 112.7409 153.5957 161.4398 213.0495 242.2803 245.2665 247.1796 257.2171 346.8588 358.3643 400.0738 428.8111 493.2628 562.6798 574.9200 649.8562 661.6487 680.0178 695.3464 696.4586 733.4443 777.9152 797.9454 825.3980 844.7098 910.6179 918.8965 924.0325 936.4731 992.2778 1018.2954 1028.4832 1104.0288 1122.6195 1134.3962 1139.0696 1157.8518 1179.5772 1221.5452 1251.4086 1265.6753 1334.2981 1342.8594 1359.5103 1373.9619 1398.7116 1463.0979 1469.7641 1476.3619 1488.4891 1517.2514 1554.4404 1588.6445 1688.7838 2998.5369 3012.1621 3030.5447 3071.8991 3095.7623 3111.0593 3242.2870 3261.3634 3402.5321
redmass: 2.3571 5.5877 6.0547 8.3473 5.9174 4.1159 5.6959 5.0667 7.4773 5.1630 6.4396 3.2021 1.2695 7.6295 3.9442 5.2099 6.8727 7.3726 7.1149 5.7749 8.0900 2.1761 1.8037 8.7256 6.9848 6.6977 12.9921 5.2153 1.0960 1.3048 3.7241 1.3752 8.1918 1.4947 5.6453 4.5936 1.3053 2.4921 3.5829 3.4903 6.2317 1.4682 3.1392 3.2013 1.7417 1.1278 5.8424 1.9618 7.1875 1.4131 3.7589 1.2621 1.0405 2.1842 1.1606 1.1108 2.9998 6.2946 6.1989 10.2406 1.0358 1.0580 1.0887 1.1071 1.0985 1.1029 1.0953 1.1045 1.0755
irintensity: 0.0354 1.4560 2.7564 8.2978 3.1425 0.8873 7.5292 3.0983 3.1145 0.1252 6.9925 38.4211 0.3756 1.0049 12.5269 0.1393 1.6289 6.6787 0.1315 0.7919 4.3672 17.9170 38.8680 12.1184 54.5353 1.3683 14.4862 16.0906 4.2149 58.8784 9.1786 4.7083 11.1420 41.3351 16.8482 102.4633 87.1186 194.6293 427.2370 300.4541 83.1277 5.4909 529.5360 367.4443 241.2656 0.0038 234.0656 7.5587 113.4025 14.4764 25.4903 32.0761 12.9544 572.3071 39.9331 32.7523 68.5932 129.5163 57.8090 341.6708 21.1346 22.9610 26.3318 7.3098 28.8234 42.6753 0.2149 5.8390 8.8002
temp: 298.150 k
press: 1.00000 atm
elementType: 8 8 8 8 8 7 7 7 6 6 6 6 6 6 6 6 1 1 1 1 1 1 1 1 1
symmnumber: 1
zpe: 460885.6 jmol-1
zpe.correction: 0.175542 hartree
zpe.thermalcorrener: 0.190370 hartree
zpe.thermalcorrenthalpy: 0.191314 hartree
zpe.thermalcorrgfe: 0.131574 hartree
zpe.sumelectzpe: -849.293484 hartree
zpe.sumelectthermal: -849.278655 hartree
zpe.sumelectthermalent: -849.277711 hartree
zpe.sumelectthermalfe: -849.337451 hartree
dipole: -7.5112 -0.5042 0.0008
dipole: 7.5281
quadrupole: -106.6504 -94.4827 -91.1314
quadrupole: 20.8302 0.0027 0.0015
quadrupole: -9.2289 2.9388 6.2901 20.8302 0.0027 0.0015
hfenergy: -849.4690256 hartree
pointgroup: C01 [X(C8H9N3O5)]
dipole: 2.9527099 -0.2317542 -0.0001185 debye
dipolederiv: 0.0893273 0.0387291 0.000035 -0.1031019 -0.5442626 -0.0001108 0.0000008 -0.0001027 -0.0879166 -2.4102336 0.2967643 -0.0000553 0.7064609 -0.6281457 -0.0000894 0.0003053 -0.0001448 -0.3056086 -1.2346624 0.1056311 -0.0001143 0.3850296 -0.5086484 0.0000186 0.0000681 -0.0000651 -0.2425479 -0.5828233 -0.1002809 -0.0000561 -0.5838222 -0.8288132 -0.0002196 -0.0000949 -0.0000739 -0.2256434 -0.8611371 -0.0704898 -0.0000949 -0.5064003 -0.9468595 -0.0003919 -0.0002387 -0.0003127 -0.3158679 2.563594 0.2560967 0.0003227 0.7277308 1.23958 0.0002842 0.0002704 0.0002161 0.2078498 -2.8944644 -0.2629881 -0.0004284 0.1943726 -0.1565438 0.0000635 -0.0004053 0.0000088 -0.3100348 1.7980867 0.0448842 0.0002755 -0.6369718 -0.2105585 -0.0001412 0.0000631 -0.0000314 -0.0753529 0.6220828 -0.0360567 0.0000583 -0.5015672 0.2120363 -0.0000294 -0.0000294 0.0000159 0.0681285 -0.5096236 0.0232965 -0.0000316 0.577843 -0.0292744 0.0000949 0.0000899 0.000037 -0.164807 -1.3474289 -0.3070741 -0.0002289 -0.7502724 0.02359 -0.0000764 -0.000305 -0.0000457 0.0752674 0.5188962 0.0411513 0.0000829 0.2781785 0.0782219 0.000065 0.0001099 0.0000395 -0.1079095 1.3729548 -0.0808569 0.0000899 0.1553279 0.2375969 -0.0000188 0.0000549 -0.0000032 0.3536643 -0.6769507 -0.0388819 -0.0000678 -0.5512829 0.3459469 0.0000577 -0.0003187 0.0001225 -0.1005265 -0.1432183 0.0868891 0.0000903 0.0467103 -0.0170337 -0.0001436 0.0000717 -0.0001354 0.0628896 3.5598086 0.0614792 0.0003857 0.7056667 1.4690395 0.000687 0.0006141 0.0005368 0.3229218 0.071538 -0.0539699 -0.000026 -0.0448445 0.0975656 -0.0000261 -0.000018 -0.0000272 0.1945026 0.0831893 0.0434633 -0.0000049 0.01411 0.1149068 -0.0000166 -0.0000106 -0.0000143 0.1979265 -0.0910733 0.0307409 -0.0162648 -0.0708552 0.005339 0.0898943 0.0224188 0.1003675 -0.055491 -0.0912572 0.0306824 0.0162549 -0.07083 0.0057352 -0.0898103 -0.0225937 -0.1003082 -0.0560006 0.0092671 0.0284027 -0.0000195 0.071653 -0.0965332 -0.0000784 -0.0000016 -0.0000854 0.2106138 -0.1667146 -0.0529366 -0.000053 -0.0697152 0.0544655 -0.0000607 -0.0000619 -0.0000659 0.1197909 0.1309648 -0.0271565 0.0439337 0.0341398 0.0076657 0.0986355 0.0156126 0.1143647 -0.0606637 0.1309718 -0.0270778 -0.0440215 0.0341346 0.0081682 -0.0984703 -0.0155841 -0.1141883 -0.0611525 0.0589059 -0.0304416 -0.0000617 -0.0416943 0.0668155 -0.0001171 -0.0000178 -0.0001043 0.3559677 unknown
polarizability: 347.3351119|2.7650752|126.9291211|0.0345978|0.0196974|59.9086133 unknown
InChI: InChI=1S/C8H9N3O5/c1-2-15-8(12)10-9-5-6-3-4-7(16-6)11(13)14/h3-5,10H,2H2,1H3
charge 0 multiplicity 1
25 atoms
O  -2.442821 -0.720714 -0.000426
O  4.497544 -0.59406 0.0004
O  -5.870797 0.325011 -0.000505
O  -4.942321 -1.78335 -0.000821
O  3.570289 1.578067 0.001338
N  -4.858688 -0.49242 -0.00067
N  2.259591 -0.407132 0.000279
N  1.054216 0.236316 0.000305
C  -1.324011 0.141843 -0.000097
C  -1.757367 1.477546 0.000149
C  -3.562965 0.116472 -0.000381
C  -3.186078 1.458998 -0.000048
C  5.87348 -0.008856 0.000919
C  -0.037779 -0.509122 -0.000099
C  6.849254 -1.179982 -0.000578
C  3.45309 0.339088 0.000736
H  -1.101099 2.344264 0.00042
H  -3.868358 2.304681 0.000044
H  5.976215 0.630789 -0.894066
H  5.976427 0.628672 0.897389
H  -0.043431 -1.614165 -0.000407
H  7.885798 -0.796928 -0.000247
H  6.713034 -1.810204 0.894405
H  6.712811 -1.808065 -0.897028
H  2.347867 -1.434549 -0.000107
