program: Gaussian 09
title: 000221598
version: EM64L-G09RevD.01
frameworkgroup: C1[X(C8H8N4O4)]
method: RPBEPBE
basis: SDD
operation: Freq
keyword: #pfreq=noraman
keyword: PBEPBE/SDD
title: #p freq=noraman PBEPBE/SDD
converged: NO NO NO NO
title: Mulliken charges:
elementType: O O O O N N N N C C C C C C C C H H H H H H H H
charge: -0.247187 -0.225741 -0.222538 -0.208085 -0.213672 0.070549 -0.314093 0.049314 -0.380328 -0.313340 0.234766 0.360315 -0.352859 -0.313330 0.270252 -0.303502 0.260367 0.260564 0.242770 0.242768 0.245113 0.295975 0.293623 0.268298
chargesum: 0.00000
title: Mulliken charges with hydrogens summed into heavy atoms:
elementType: O O O O N N N N C C C C C C C C
charge: -0.247187 -0.225741 -0.222538 -0.208085 -0.213672 0.070549 -0.045795 0.049314 0.140603 0.172198 0.234766 0.360315 -0.107747 -0.017355 0.270252 -0.009880
polarizability: 3.33820253e+02 -6.55730464e+00 1.43981222e+02 9.54031028e-03 6.55148674e-03 5.88013103e+01
1716.lowfreq: -73.0989 -7.5513 -7.2986 -3.1403 -0.0007 -0.0005 0.0003 39.7931 44.6214
frequency: -73.0947 39.7389 44.1627 50.5813 79.3200 127.1719 148.6038 151.6231 205.8116 211.3678 260.7642 319.6717 368.1549 391.4222 451.4701 511.6801 534.6784 561.2210 628.6972 642.3814 655.7764 673.7790 677.5979 728.5526 740.2400 755.2219 819.1661 824.0795 854.3897 870.8474 896.5420 910.8610 918.1075 944.0811 956.0087 1017.3097 1020.4979 1072.0644 1096.1655 1133.8204 1161.7352 1175.7992 1188.2737 1208.3447 1213.0992 1227.6199 1267.4796 1338.0615 1345.0546 1351.9427 1373.1191 1385.7618 1485.3782 1496.4627 1499.8613 1549.3929 1580.3022 1703.4201 2979.8320 3031.6832 3041.4672 3065.0537 3109.8524 3242.8936 3261.4830 3450.5948
redmass: 2.0609 5.9071 9.6054 7.0304 7.4698 5.4159 5.8593 8.5181 6.2358 6.3350 7.6233 2.7908 7.2073 5.9872 9.4017 4.7036 7.0430 5.7356 8.2851 9.7202 4.5320 6.6017 8.7993 8.7735 7.8067 1.1650 6.0854 1.2998 1.1610 2.4077 1.4507 1.3802 7.5142 5.0005 4.5470 1.4822 2.6069 2.3352 1.5078 5.5935 4.8536 1.1030 5.3652 2.8035 1.1122 1.8689 6.2677 1.5512 5.3527 1.5308 4.1756 2.7024 1.0936 1.6907 2.2235 6.0221 7.0380 7.2401 1.0572 1.1075 1.0581 1.0879 1.1116 1.0950 1.1046 1.0777
irintensity: 0.8188 5.8912 1.5201 7.0434 1.7840 3.0517 7.6672 1.3654 0.7712 0.5648 0.0337 6.1570 3.1495 10.1028 3.7368 26.6619 6.7636 0.4220 1.0004 6.2236 1.4646 1.2892 13.4927 16.9720 3.8846 106.3853 35.4706 59.1278 9.9998 219.6956 34.2573 0.0014 15.2782 7.1167 139.9673 73.3638 9.1291 152.0373 0.1393 154.2122 11.2697 0.4877 24.7877 130.4504 0.8498 466.9729 472.4685 8.8175 102.2789 19.7437 181.4955 296.1351 32.8324 62.0617 30.0065 114.0148 178.5796 425.6833 16.0629 12.5921 58.5128 22.4133 20.7674 0.2171 5.3878 37.2040
temp: 298.150 k
press: 1.00000 atm
elementType: 8 8 8 8 7 7 7 7 6 6 6 6 6 6 6 6 1 1 1 1 1 1 1 1
symmnumber: 1
zpe: 436802.0 jmol-1
zpe.correction: 0.166369 hartree
zpe.thermalcorrener: 0.179762 hartree
zpe.thermalcorrenthalpy: 0.180706 hartree
zpe.thermalcorrgfe: 0.124173 hartree
zpe.sumelectzpe: -828.207291 hartree
zpe.sumelectthermal: -828.193899 hartree
zpe.sumelectthermalent: -828.192955 hartree
zpe.sumelectthermalfe: -828.249487 hartree
dipole: -7.6312 -1.8518 0.0037
dipole: 7.8527
quadrupole: -115.7614 -87.1784 -90.7326
quadrupole: 24.6887 0.0033 0.0081
quadrupole: -17.8706 10.7124 7.1582 24.6887 0.0033 0.0081
hfenergy: -828.3736604 hartree
pointgroup: C01 [X(C8H8N4O4)]
dipole: 3.0306615 -0.4839798 0.3545225 debye
dipolederiv: -1.1064784 0.3048921 -0.329764 0.2482058 -0.5202632 0.3452387 -0.2525748 0.3400158 -0.6882385 0.0486213 0.0447814 -0.0755676 -0.0527519 -0.2457806 0.217474 0.0577478 0.2075591 -0.3811996 -1.3316195 0.0783329 0.0017923 0.2666714 -0.3388548 0.0982023 -0.25394 0.116682 -0.382229 -0.5271787 -0.0278293 0.0681954 -0.3528278 -0.4426592 0.3250256 0.5145491 0.2931815 -0.6843064 -2.6552482 -0.1391133 0.4426225 0.1401326 -0.2417301 0.0960892 0.0626871 0.1236249 -0.3380272 1.8861886 0.0408193 -0.2509447 -0.1503048 -0.1205977 0.1052822 0.0101968 0.0858889 -0.1738754 -0.4069293 0.0410304 -0.0632588 -0.3957793 -0.7529983 0.4227073 0.5342459 0.3783698 -1.0455031 2.5432098 0.0915676 -0.3614418 0.4009655 0.565465 -0.530255 -0.7879906 -0.4992122 0.9714483 -0.0704289 0.0246981 0.0065357 -0.0360317 0.2964058 0.0354316 0.0884958 0.0297256 0.2718453 0.3488814 0.0178364 -0.0221168 -0.1480372 0.4417288 -0.0849953 0.2036199 -0.1020962 0.4858996 2.2384687 -0.152561 -0.0034758 0.5227467 0.7164772 -0.8169182 -0.9291369 -0.7486946 1.2770802 0.8639889 -0.0478403 -0.0144355 -0.3857153 0.1279384 -0.0447436 0.4482643 -0.0788395 0.1295683 -0.7797165 -0.0401429 0.1187177 -0.3773656 0.0038471 -0.1663385 0.5820436 -0.2000862 0.0712787 -0.6442363 0.0082528 0.0364795 0.3801063 -0.1290536 -0.0951279 -0.4734883 -0.0576499 -0.0438154 -1.2904697 -0.1658948 0.3647042 -0.4856111 0.0495171 0.0761087 0.8032086 0.0437331 -0.0718631 0.5553077 0.0164722 -0.0894822 0.1889133 -0.0409994 -0.1116458 -0.3261213 -0.0942794 0.0536481 0.0333935 -0.1036212 0.0184185 0.0149302 -0.0840863 0.0203878 -0.0629854 -0.0150675 0.0441329 0.0440127 0.0125207 0.0891344 0.0507939 0.0268026 -0.0666622 -0.0443039 -0.0151258 -0.0785892 0.0168921 -0.0281272 -0.0466691 -0.0431067 0.0380849 -0.0477918 -0.1280109 0.0075059 -0.0975151 0.0359807 0.0389121 0.0181598 0.1251639 -0.1148597 0.039324 0.0027177 -0.0089855 0.0356097 0.0099024 0.0254502 -0.0149062 0.0507594 0.1070431 0.1349843 -0.0497522 0.1374496 0.0254411 0.0808729 -0.0285665 0.050512 -0.0216211 0.1602257 0.0480205 0.0411001 0.0487321 0.122765 0.0765594 0.0307073 -0.0299658 0.0129828 0.1667955 0.0399631 -0.0056828 0.0381879 0.1451223 0.0300253 -0.042577 0.0867565 0.0467802 0.3315516 -0.039761 -0.0348897 -0.0306195 0.3513225 unknown
polarizability: 331.6621482|-3.487692|88.51532|-22.7681026|-40.3698324|116.4253178 unknown
InChI: InChI=1S/C8H8N4O4/c9-8-11(3-4-15-8)10-5-6-1-2-7(16-6)12(13)14/h1-2,5,9H,3-4H2
charge 0 multiplicity 1
24 atoms
O  4.972047 -0.023107 -0.104469
O  -1.963813 -0.20657 0.848306
O  -5.462251 0.406405 0.363254
O  -4.360194 -0.837678 1.956177
N  2.689717 0.026585 0.060747
N  1.427427 0.373531 -0.288359
N  3.725765 1.261088 -1.735608
N  -4.385607 -0.074896 0.911694
C  3.086235 -0.832989 1.200957
C  4.631705 -0.864409 1.079854
C  3.796803 0.501031 -0.702273
C  -0.922705 0.305294 0.04214
C  0.410414 -0.078064 0.433749
C  -1.46503 1.094736 -0.985276
C  -3.149765 0.287498 0.29064
C  -2.88412 1.081895 -0.824653
H  2.634204 -1.838371 1.101694
H  2.746641 -0.389042 2.156233
H  5.13554 -0.423195 1.954182
H  5.022461 -1.876423 0.889595
H  0.490266 -0.729068 1.318928
H  -0.883247 1.607624 -1.746865
H  -3.632495 1.581287 -1.433863
H  4.6392 1.499139 -2.155684
