program: Gaussian 09
title: 000221597
version: EM64L-G09RevD.01
frameworkgroup: C1[X(C8H7N3O4S)]
method: RPBEPBE
basis: SDD
operation: Freq
keyword: #p
keyword: freq=noraman
keyword: PBEPBE/SDD
title: #p freq=noraman PBEPBE/SDD
converged: YES YES NO NO
title: Mulliken charges:
elementType: S O O O O N N N C C C C C C C C H H H H H H H
charge: 0.228677 -0.222735 -0.125692 -0.215762 -0.201634 -0.149974 0.062940 0.050417 -0.278784 -0.713383 -0.047083 0.358760 -0.338803 -0.307668 0.273392 -0.299531 0.249619 0.265855 0.280230 0.294268 0.244351 0.296794 0.295747
chargesum: 0.00000
title: Mulliken charges with hydrogens summed into heavy atoms:
elementType: S O O O O N N N C C C C C C C C
charge: 0.228677 -0.222735 -0.125692 -0.215762 -0.201634 -0.149974 0.062940 0.050417 0.236690 -0.138886 -0.047083 0.358760 -0.094452 -0.010874 0.273392 -0.003784
polarizability: 3.59938013e+02 3.73253412e-01 1.46780468e+02 1.16443531e+00 6.34727404e-01 6.20912291e+01
1716.lowfreq: -8.9028 0.0009 0.0015 0.0016 2.7870 5.6323 34.5948 42.5575 50.6538
frequency: 34.4807 42.5212 50.6465 74.0730 108.3764 140.1494 150.9616 169.4521 196.4965 215.9120 260.9292 311.9179 376.5697 381.9287 416.8442 455.0036 470.5458 528.3196 562.6891 581.4917 604.1982 645.6242 653.5318 679.7810 688.2918 733.8852 794.1402 827.8568 849.9237 888.4560 904.7967 913.9189 920.6862 945.7679 1006.1990 1018.9017 1032.3633 1124.4572 1136.0933 1140.7690 1170.6435 1194.2133 1217.7889 1231.9855 1263.5480 1292.3148 1342.1129 1352.7114 1360.7825 1378.7267 1459.3540 1473.1372 1494.0806 1549.7148 1577.4144 1684.2127 2982.8221 3045.7080 3061.8089 3067.7571 3140.6891 3241.3505 3260.0034
redmass: 7.6303 8.2985 8.6599 8.2414 6.0149 2.9179 9.3372 4.2348 6.9875 6.0124 8.7280 2.8235 7.4006 11.8396 11.5985 9.0483 7.4851 6.1016 5.7830 8.6921 11.2191 7.6327 4.4581 8.6245 3.6911 12.9789 5.0531 1.2991 1.6867 4.5081 1.5093 1.3948 7.7199 4.7758 1.6345 1.2891 2.0130 3.6266 4.6301 3.2766 2.5145 1.9301 1.7120 1.4285 5.9267 1.1994 8.4260 1.5232 2.9174 2.6765 1.0866 1.0918 8.5589 5.7749 6.9216 12.7474 1.0597 1.0976 1.0643 1.0881 1.1092 1.0952 1.1046
irintensity: 9.8576 1.6028 8.3153 0.5955 1.3457 1.2599 1.1715 4.1743 0.8027 0.5855 0.8339 10.6646 0.5777 3.8696 10.7776 0.2838 3.1041 16.9890 0.5947 14.5373 3.7972 6.0128 1.7301 12.1421 4.7674 22.1335 45.6381 57.1852 9.9566 280.7718 39.4767 0.6263 36.3147 6.9325 24.7076 66.4940 5.0486 449.4636 6.8153 188.6758 61.9140 40.4594 98.0451 212.8102 403.5759 10.2381 85.5883 82.1131 210.4688 17.9477 15.6819 23.8577 87.6015 62.9413 92.2047 349.1434 16.4417 7.0976 21.8391 24.1347 6.2808 0.2677 6.3900
temp: 298.150 k
press: 1.00000 atm
elementType: 16 8 8 8 8 7 7 7 6 6 6 6 6 6 6 6 1 1 1 1 1 1 1
symmnumber: 1
zpe: 400042.2 jmol-1
zpe.correction: 0.152368 hartree
zpe.thermalcorrener: 0.166722 hartree
zpe.thermalcorrenthalpy: 0.167666 hartree
zpe.thermalcorrgfe: 0.108804 hartree
zpe.sumelectzpe: -1170.952958 hartree
zpe.sumelectthermal: -1170.938604 hartree
zpe.sumelectthermalent: -1170.937659 hartree
zpe.sumelectthermalfe: -1170.996522 hartree
dipole: -5.1079 -2.8209 0.5776
dipole: 5.8635
quadrupole: -135.4313 -98.0131 -97.6260
quadrupole: 31.3327 -0.5190 -0.3656
quadrupole: -25.0745 12.3437 12.7308 31.3327 -0.5190 -0.3656
hfenergy: -1171.1053258 hartree
pointgroup: C01 [X(C8H7N3O4S1)]
dipole: -1.9850757 1.1402004 -0.2848949 debye
dipolederiv: -0.7100263 0.3704584 -0.0618133 0.4223466 -0.3173501 0.0175289 0.0120857 -0.0278958 -0.0553858 0.0916278 0.0459109 0.0018774 -0.0838539 -0.538007 -0.0177883 0.0021321 -0.0149483 -0.0883346 -0.5872691 0.1117423 -0.0156289 -0.4409039 -1.1835382 0.0592162 0.0241029 0.0795149 -0.2618409 -1.2687212 0.1124223 -0.0091147 0.3736429 -0.5027631 -0.0043235 -0.0032889 -0.0073591 -0.2415589 -0.5772134 -0.0859619 -0.0074282 -0.6011555 -0.8163562 -0.0272528 -0.0264493 -0.0214043 -0.226293 -2.7673688 -0.1566171 -0.0155282 -0.0368415 -0.4419371 0.0070047 0.0115084 0.0570671 -0.1496418 1.6692303 0.0123728 0.0251122 -0.3505666 -0.1993093 -0.0000131 0.0018871 -0.004082 -0.0753006 2.5956404 0.2294641 0.0387965 0.7864067 1.2257162 0.0438811 0.0652115 0.0386909 0.2103353 -0.0630158 0.0004466 -0.0151457 -0.1648108 0.2304966 0.0791963 0.0839919 0.0816892 0.3086815 0.0133507 0.0690463 -0.0445313 0.0421469 0.2432226 -0.0794727 -0.0116088 -0.0625208 0.1537826 2.6050223 -0.2383376 0.0206374 0.9193854 1.5859118 -0.0897892 -0.1191898 -0.1013045 0.1438217 0.6244311 -0.0528691 0.0027795 -0.4863262 0.2322518 -0.0006709 -0.014199 0.0052209 0.0567547 -0.5830613 -0.0241093 0.0032187 -0.607709 0.2823766 0.0185387 0.0054075 0.0099267 -0.1098538 -0.5267339 0.0267719 -0.0020155 0.5677528 -0.0363803 0.0118981 0.0148677 0.0026298 -0.1601378 -1.3685177 -0.2804478 -0.0254435 -0.7904689 0.0145794 -0.0135247 -0.0504704 -0.0058016 0.0758342 0.5138672 0.03197 0.0097228 0.2879898 0.0830931 0.0102891 0.0202624 0.0065341 -0.1059952 -0.0088384 -0.1178388 0.0847134 -0.0051717 0.0328347 0.0177544 0.034257 0.0364395 0.0239313 0.048911 -0.0128468 -0.0419573 0.076901 -0.0042854 -0.0215569 -0.0222386 -0.0852204 -0.0824492 0.0438704 0.0181576 0.0289703 0.0751242 -0.0573497 -0.0333662 0.0256097 -0.0513257 0.0751857 0.0688372 -0.0631642 0.027092 -0.0174609 0.0203729 0.0418975 -0.0487793 0.0725417 -0.0871154 0.0289408 0.0172528 -0.0010424 0.0712518 -0.0732128 -0.013711 0.0003412 -0.0039593 0.2059664 0.0760081 -0.0560355 -0.003203 -0.0494148 0.1017095 -0.0035657 -0.0032558 -0.0025092 0.1923099 0.0810287 0.0422122 -0.000068 0.0117354 0.1179241 -0.00217 -0.0021853 -0.0019238 0.1973035 unknown
polarizability: 359.8368215|-4.6993023|146.8006303|0.8522616|-2.7407798|62.1722587 unknown
InChI: InChI=1S/C8H7N3O4S/c12-8-10(3-4-16-8)9-5-6-1-2-7(15-6)11(13)14/h1-2,5H,3-4H2
charge 0 multiplicity 1
23 atoms
S  -5.315338 0.197013 0.03424
O  2.082788 0.607488 -0.046243
O  -3.655561 -2.019574 0.083679
O  5.53296 -0.36284 -0.023159
O  4.557032 1.723123 0.03176
N  -2.635416 0.121989 -0.140745
N  -1.38348 -0.435642 -0.132772
N  4.503102 0.431295 -0.012859
C  -2.930749 1.577084 -0.096487
C  -4.403486 1.764623 -0.508783
C  -3.729894 -0.788439 -0.010581
C  0.983304 -0.277707 -0.094344
C  -0.317318 0.347617 -0.090102
C  1.444657 -1.603439 -0.132504
C  3.221126 -0.205843 -0.055547
C  2.872478 -1.555182 -0.107133
H  -2.269157 2.110763 -0.802969
H  -2.740982 1.961669 0.925124
H  -4.859601 2.625697 -0.000988
H  -4.514919 1.863234 -1.598615
H  -0.323467 1.448078 -0.043201
H  0.80655 -2.482858 -0.171841
H  3.573172 -2.38575 -0.123528
