program: Gaussian 09
title: 000221573
version: EM64L-G09RevD.01
frameworkgroup: C1[X(C15H24O)]
method: RPBEPBE
basis: SDD
operation: Freq
keyword: #pfreq=noraman
keyword: PBEPBE/SDD
title: #p freq=noraman PBEPBE/SDD
converged: YES YES NO NO
title: Mulliken charges:
elementType: O C C C C C C C C C C C C C C C H H H H H H H H H H H H H H H H H H H H H H H H
charge: -0.267785 0.147302 0.301568 -0.412914 0.509809 -0.722089 -0.781512 -0.732192 -0.730406 -0.718435 -0.396124 -0.419422 -0.395914 -0.387719 0.316611 -0.537342 0.187189 0.190652 0.216185 0.223491 0.206859 0.213012 0.219546 0.212839 0.212552 0.210236 0.210254 0.204673 0.205502 0.232570 0.198536 0.228373 0.219184 0.226774 0.245615 0.245833 0.235095 0.219193 0.218944 0.243458
chargesum: 0.00000
title: Mulliken charges with hydrogens summed into heavy atoms:
elementType: O C C C C C C C C C C C C C C C
charge: -0.267785 0.147302 0.301568 -0.035073 0.509809 -0.075555 -0.136117 -0.099150 -0.087661 -0.072340 -0.169350 -0.173807 -0.150081 -0.152625 0.316611 0.144253
polarizability: 2.11480590e+02 1.56762826e+01 1.36749430e+02 5.62874428e+00 -5.46441413e+00 1.48300450e+02
1716.lowfreq: -9.3695 -0.0009 -0.0005 -0.0003 0.8165 10.1091 41.0783 48.9648 62.6350
frequency: 41.0452 48.7014 62.4611 94.9843 133.4443 160.7132 174.3206 205.9986 208.3689 223.2998 244.6303 246.8705 251.7183 262.2948 283.3996 291.0202 303.8733 332.0376 349.5238 358.2336 382.3455 401.5974 414.4554 423.0282 440.9769 479.8261 507.7467 518.8082 572.4014 631.8788 646.8593 735.3647 741.3133 778.2022 813.3407 827.6738 834.7080 866.2905 904.9447 920.1203 928.2980 935.6254 941.3463 942.5916 962.5198 976.3567 990.2551 1001.4030 1005.1864 1025.1300 1032.9052 1094.9939 1113.2857 1113.5718 1131.6869 1156.3698 1161.5915 1184.7176 1195.2113 1220.3174 1233.9569 1251.6103 1255.8031 1307.9078 1322.1575 1337.5772 1366.0670 1370.5728 1376.7634 1379.8612 1397.4800 1403.4707 1415.9558 1436.9026 1451.6778 1458.2391 1462.2949 1465.0515 1466.3929 1467.0719 1471.0850 1474.2400 1478.2504 1481.2203 1487.8704 1496.9385 1501.7042 1503.3198 1580.9110 1623.1013 2951.5933 2955.6373 2962.0206 2969.1237 2970.7108 2975.7585 2978.7565 3010.1563 3041.5226 3054.4308 3059.0708 3061.5168 3064.0606 3066.7165 3066.9184 3076.9067 3081.6777 3083.2509 3098.2793 3121.7910 3127.3655 3143.2376 3161.1520 3166.0866
redmass: 3.6585 2.8047 3.3567 3.3669 3.1795 3.3462 1.6564 1.8094 1.4970 1.8513 1.1361 1.4463 1.4355 1.0957 1.9183 2.5477 2.8234 2.4557 1.2537 2.2043 2.3623 1.9421 3.0149 3.1508 2.7273 2.6483 2.9227 3.0268 2.5421 5.9337 4.3912 3.4784 3.5898 5.3564 1.3198 2.4676 1.5932 2.0120 2.0697 1.6488 1.5864 1.5275 1.2679 1.3528 1.3602 1.7644 7.8331 2.2579 1.5124 1.4189 1.4027 1.9579 1.3529 1.5941 1.8507 1.5293 1.5098 1.4265 2.3819 2.9216 2.5333 3.1290 3.3593 1.2935 1.5642 1.3530 4.8586 1.2012 1.2216 1.2022 1.2280 1.2106 3.4460 1.1628 1.0745 1.0550 1.0497 1.0481 1.0502 1.0660 1.0608 1.0698 1.0546 1.0565 1.0612 1.0730 1.0631 2.1925 6.8890 6.3603 1.0603 1.0331 1.0349 1.0350 1.0369 1.0378 1.0368 1.0977 1.1037 1.0994 1.0990 1.0995 1.0995 1.0985 1.0985 1.0996 1.0991 1.0990 1.0953 1.0991 1.0877 1.0862 1.0948 1.0953
irintensity: 0.9074 0.2487 0.5882 3.3987 2.0372 1.3759 0.2863 0.7468 0.1853 0.5835 0.1304 0.1630 0.6076 0.0387 0.2170 1.4603 0.5915 1.1123 0.1007 0.5450 0.2438 0.1777 0.0718 0.2591 0.1876 0.0945 3.5038 7.5857 19.2843 1.8909 8.2244 1.0576 2.9862 9.8509 17.5927 2.4625 53.2004 0.8065 1.5672 3.8259 3.0890 2.6890 0.0756 0.1710 0.1166 10.3777 39.3992 14.1218 6.8579 0.7128 0.1699 2.8493 1.4559 5.7769 7.1294 1.7097 0.8999 92.0825 14.7434 8.3642 132.2389 21.0769 31.0595 0.5479 12.7017 7.0185 8.9080 10.3364 27.5764 17.8866 16.1204 15.0137 6.9872 9.0943 3.0436 1.6058 0.2978 2.8159 11.9167 2.8563 12.8984 50.4333 21.8894 6.8729 19.0620 13.5451 21.8348 119.3735 11.7626 36.1781 31.8686 71.9526 39.3693 41.0930 43.7114 24.0686 30.0245 26.0907 50.8689 5.3409 39.0680 17.7556 6.3742 29.3314 171.5019 38.9549 48.7973 28.8537 36.1322 29.2451 18.1964 11.1217 19.1319 4.5786
temp: 298.150 k
press: 1.00000 atm
elementType: 8 6 6 6 6 6 6 6 6 6 6 6 6 6 6 6 1 1 1 1 1 1 1 1 1 1 1 1 1 1 1 1 1 1 1 1 1 1 1 1
symmnumber: 1
zpe: 922353.0 jmol-1
zpe.correction: 0.351306 hartree
zpe.thermalcorrener: 0.369350 hartree
zpe.thermalcorrenthalpy: 0.370295 hartree
zpe.thermalcorrgfe: 0.306922 hartree
zpe.sumelectzpe: -659.941254 hartree
zpe.sumelectthermal: -659.923209 hartree
zpe.sumelectthermalent: -659.922265 hartree
zpe.sumelectthermalfe: -659.985638 hartree
dipole: -0.3090 0.3553 -1.4310
dipole: 1.5065
quadrupole: -91.6643 -102.5035 -96.6632
quadrupole: 1.8800 8.6709 -0.3133
quadrupole: 5.2794 -5.5598 0.2805 1.8800 8.6709 -0.3133
hfenergy: -660.2925598 hartree
pointgroup: C01 [X(C15H24O1)]
dipole: 0.1413878 -0.0941568 -0.5678323 debye
polarizability: 211.9697116|15.2848032|135.672862|-2.0178952|5.037997|148.8878963 unknown
InChI: InChI=1S/C15H24O/c1-14(2,3)11-15(4,5)12-7-9-13(16-6)10-8-12/h7-10H,11H2,1-6H3
charge 0 multiplicity 1
40 atoms
O  4.163861 0.693457 0.638996
C  -1.270663 -1.259553 -0.072811
C  -2.739923 1.086664 -0.109688
C  -2.33292 -0.279153 0.55212
C  0.174952 -0.715989 0.053227
C  -1.345791 -2.577658 0.76944
C  -1.625149 -1.640663 -1.532972
C  -3.452108 1.913861 1.001982
C  -3.761072 0.889832 -1.266434
C  -1.527382 1.906729 -0.622393
C  0.680539 -0.307412 1.32156
C  1.068999 -0.648694 -1.040874
C  1.997444 0.153161 1.485965
C  2.400931 -0.188758 -0.901275
C  2.868026 0.217706 0.369524
C  5.095429 0.775678 -0.48638
H  -3.269529 -0.864131 0.677647
H  -1.98911 -0.049095 1.580878
H  -1.172463 -2.382729 1.843418
H  -0.581117 -3.299723 0.42935
H  -2.341935 -3.048583 0.664979
H  -0.985283 -2.470174 -1.888637
H  -2.674499 -1.982345 -1.587406
H  -1.507023 -0.796856 -2.234662
H  -2.752298 2.159337 1.823049
H  -4.302572 1.352001 1.434186
H  -3.845142 2.863939 0.593217
H  -4.648942 0.329194 -0.915581
H  -4.108357 1.873245 -1.637423
H  -3.330867 0.343788 -2.12171
H  -1.867766 2.900414 -0.972992
H  -0.777018 2.061936 0.173693
H  -1.014766 1.40899 -1.463969
H  0.035168 -0.349011 2.206503
H  0.737157 -0.955512 -2.03749
H  2.374552 0.46599 2.464691
H  3.050569 -0.153882 -1.781418
H  4.724003 1.466577 -1.268732
H  5.27957 -0.221599 -0.932385
H  6.029992 1.168221 -0.058992
