program: Gaussian 09
title: 000221569
version: EM64L-G09RevD.01
frameworkgroup: C1[X(C14H27N)]
method: RPBEPBE
basis: SDD
operation: Freq
keyword: #pfreq=noraman
keyword: PBEPBE/SDD
title: #p freq=noraman PBEPBE/SDD
converged: YES YES NO NO
title: Mulliken charges:
elementType: N C C C C C C C C C C C C C C H H H H H H H H H H H H H H H H H H H H H H H H H H H
charge: -0.366768 0.274224 -0.395766 0.306988 -0.781479 -0.728403 -0.189250 -0.732747 -0.729147 -0.725711 -0.050696 -0.741066 -0.715950 0.223886 -0.549455 0.190374 0.198394 0.262573 0.244938 0.202626 0.229520 0.215532 0.203207 0.223454 0.220583 0.205065 0.204795 0.239859 0.206367 0.205496 0.213110 0.212437 0.209697 0.212140 0.205066 0.214375 0.231761 0.220420 0.241307 0.211999 0.197635 0.278611
chargesum: 0.00000
title: Mulliken charges with hydrogens summed into heavy atoms:
elementType: N C C C C C C C C C C C C C C
charge: -0.104194 0.274224 -0.006997 0.306988 -0.104395 -0.086210 0.031332 -0.083028 -0.104174 -0.091437 0.154370 -0.074511 -0.065009 0.223886 -0.270844
polarizability: 1.77663601e+02 -1.16475527e+01 1.60025608e+02 -5.03991621e+00 5.43357195e+00 1.36332954e+02
1716.lowfreq: -21.7094 -7.2391 -0.0005 -0.0004 0.0001 4.1158 33.6632 51.1596 61.1486
frequency: 32.6890 51.0759 61.1159 77.0277 100.4745 123.1412 153.1564 171.7909 191.7614 203.9166 210.1080 234.2208 237.5658 247.8544 249.6503 263.6889 287.8796 292.6895 315.5457 321.8958 326.4109 348.0278 357.1199 367.6636 383.4496 406.6765 435.7660 467.7404 474.9418 518.5797 539.3950 598.3399 619.0484 628.4243 636.9120 720.2089 774.0787 817.8082 848.9096 893.8306 904.3239 910.8315 917.0299 922.3543 928.1930 932.3645 937.6570 959.6028 973.3561 979.8996 996.6771 1024.1714 1029.2792 1042.9644 1103.1957 1123.2770 1140.7809 1157.0490 1184.9584 1212.1907 1218.8231 1233.1737 1241.1619 1251.0811 1290.6934 1319.9065 1320.6692 1335.6579 1339.6221 1369.5412 1370.9909 1371.8729 1374.9509 1386.2486 1393.2369 1400.2717 1447.8887 1449.1825 1457.7232 1460.4403 1462.9728 1464.7131 1468.3496 1468.8706 1475.8017 1480.1354 1481.4769 1486.9577 1490.4942 1492.7815 1495.2106 1501.5325 2110.8920 2959.6494 2963.8662 2968.3159 2971.1036 2973.6980 2974.7420 2975.5106 2981.1373 2981.4111 2991.3426 3016.2672 3054.2494 3057.8151 3062.4696 3062.7607 3063.9825 3066.5097 3072.7667 3073.1170 3073.5450 3075.3894 3083.8534 3085.0294 3094.6097 3115.2779 3423.6645 3443.1578
redmass: 3.5271 2.9325 3.0920 2.8725 2.5675 3.0532 2.3596 2.9886 1.5884 1.3945 1.1243 1.3227 2.6139 1.2813 1.0813 2.3223 1.8133 1.1741 3.2965 1.1450 2.3190 2.2867 2.1905 2.1933 2.3371 1.9270 2.5132 2.0685 2.8691 3.3862 2.4779 3.4038 1.8051 1.3368 1.2416 3.7976 3.1987 2.9431 1.8745 2.6314 2.0249 1.3799 1.4867 1.5596 1.5793 1.6372 1.2296 1.6477 2.0069 2.3478 1.3181 1.3996 1.4224 2.2790 1.8620 1.8588 2.3093 2.1790 2.0594 2.5976 2.4851 3.1182 1.2420 3.1484 1.3839 1.4412 1.4768 1.4022 1.3519 1.2340 1.2038 1.2193 1.2133 1.2157 1.2127 1.2073 1.0777 1.1369 1.0632 1.0549 1.0547 1.0461 1.0503 1.0517 1.0540 1.0626 1.0453 1.0585 1.0620 1.0574 1.0659 1.0620 6.0563 1.0575 1.0351 1.0358 1.0389 1.0394 1.0383 1.0383 1.0413 1.0721 1.0820 1.0998 1.0993 1.0996 1.0967 1.0990 1.0994 1.0984 1.0993 1.0995 1.0996 1.0990 1.0996 1.0992 1.0961 1.0963 1.1567 1.0744
irintensity: 0.0309 0.0491 0.1322 0.0440 0.1989 0.1676 0.5419 0.7230 0.3799 0.1966 0.2132 0.3039 0.4951 0.5467 0.5500 0.2196 0.9836 0.0857 0.9222 0.7696 4.7791 0.5233 0.2673 0.2432 0.8607 0.2981 5.3188 20.3220 1.2259 2.1008 10.9963 23.4674 27.9673 85.8176 82.4306 0.9076 2.4137 5.1709 1.2190 0.2226 8.5725 2.2460 0.7007 3.0118 6.4000 5.3107 0.0254 0.9517 5.7886 15.4143 0.4403 0.7796 1.0721 56.9009 11.0583 6.8416 12.8439 40.0695 6.2560 21.4023 12.6199 19.8427 2.8343 35.0437 12.0494 0.2237 1.5207 1.2187 21.2844 23.0963 11.2561 14.6985 37.3844 26.7159 22.5480 11.0301 1.8164 11.3102 6.5153 0.1536 5.3697 4.8247 2.8805 1.8294 3.3040 13.4741 20.2759 8.3649 20.8450 15.2074 6.0688 17.4543 8.6033 37.1844 39.6952 41.6540 41.5099 42.1516 11.5535 30.2175 20.3465 14.4753 17.2984 22.2037 8.8773 19.2459 18.1994 45.1349 40.9806 105.3821 40.5729 43.9855 60.6482 36.4975 42.1075 42.4548 26.2514 25.5846 67.5281 1.8116
temp: 298.150 k
press: 1.00000 atm
elementType: 7 6 6 6 6 6 6 6 6 6 6 6 6 6 6 1 1 1 1 1 1 1 1 1 1 1 1 1 1 1 1 1 1 1 1 1 1 1 1 1 1 1
symmnumber: 1
zpe: 986615.9 jmol-1
zpe.correction: 0.375782 hartree
zpe.thermalcorrener: 0.395586 hartree
zpe.thermalcorrenthalpy: 0.396530 hartree
zpe.thermalcorrgfe: 0.329596 hartree
zpe.sumelectzpe: -603.122221 hartree
zpe.sumelectthermal: -603.102417 hartree
zpe.sumelectthermalent: -603.101473 hartree
zpe.sumelectthermalfe: -603.168407 hartree
dipole: -0.5524 -0.3110 0.2351
dipole: 0.6761
quadrupole: -96.4936 -95.5611 -97.1937
quadrupole: -1.1266 0.1376 -1.3850
quadrupole: -0.0774 0.8550 -0.7776 -1.1266 0.1376 -1.3850
hfenergy: -603.4980035 hartree
pointgroup: C01 [X(C14H27N1)]
dipole: -0.2213178 0.0329673 -0.1437956 debye
polarizability: 174.277426|14.6314528|162.2706788|-0.000209|-7.3734209|137.4740588 unknown
InChI: InChI=1S/C14H27N/c1-9-12(11(2)3)15-14(7,8)10-13(4,5)6/h1,11-12,15H,10H2,2-8H3
charge 0 multiplicity 1
42 atoms
N  0.9964 -0.070649 -0.815911
C  -0.472583 0.221103 -1.019975
C  -1.234574 -0.677443 0.018677
C  -2.759198 -0.52431 0.365839
C  -0.755449 -0.244572 -2.472796
C  -0.786648 1.739408 -0.902807
C  1.713596 0.471208 0.367363
C  -3.026278 0.689613 1.300631
C  -3.682203 -0.428755 -0.87779
C  -3.146484 -1.813087 1.151938
C  2.848818 -0.51034 0.841384
C  3.86414 -0.797291 -0.287314
C  2.231457 -1.815713 1.386313
C  2.276066 1.833475 0.147761
C  2.764446 2.946635 -0.071066
H  -0.698985 -0.595316 0.986899
H  -1.065082 -1.719909 -0.319413
H  1.526398 0.113843 -1.67822
H  -1.813475 -0.111417 -2.744824
H  -0.150421 0.344283 -3.190834
H  -0.492311 -1.311167 -2.591349
H  -0.148832 2.309788 -1.602883
H  -1.841331 1.952094 -1.152043
H  -0.590764 2.12197 0.113992
H  0.984199 0.535052 1.199316
H  -4.086272 0.698915 1.619833
H  -2.401917 0.628931 2.212829
H  -2.816913 1.653935 0.809608
H  -4.742626 -0.461546 -0.561892
H  -3.533722 0.513455 -1.435608
H  -3.511057 -1.272816 -1.571672
H  -3.047372 -2.712572 0.515493
H  -4.193206 -1.757879 1.506434
H  -2.494416 -1.949105 2.03579
H  3.381732 0.007427 1.665781
H  4.700402 -1.411135 0.093653
H  4.289007 0.137709 -0.697157
H  3.382297 -1.359564 -1.108557
H  1.599182 -2.283158 0.610707
H  3.022373 -2.531916 1.676157
H  1.602791 -1.627689 2.277924
H  3.180616 3.919505 -0.258009
