program: Gaussian 09
title: 000221567
version: EM64L-G09RevD.01
frameworkgroup: C1[X(C13H25N)]
method: RPBEPBE
basis: SDD
operation: Freq
keyword: #pfreq=noraman
keyword: PBEPBE/SDD
title: #p freq=noraman PBEPBE/SDD
converged: NO YES NO NO
title: Mulliken charges:
elementType: N C C C C C C C C C C C C C H H H H H H H H H H H H H H H H H H H H H H H H H
charge: -0.109532 0.303258 0.010288 -0.442155 -0.510192 -0.117657 -0.719040 -0.724131 -0.726928 -0.775677 0.231272 -0.636011 -0.633966 -0.546936 0.221856 0.192388 0.195052 0.209979 0.249992 0.200679 0.215833 0.206167 0.207673 0.207489 0.209280 0.209130 0.232647 0.204411 0.203580 0.209018 0.218163 0.218499 0.241368 0.186251 0.220413 0.219465 0.184760 0.254546 0.278767
chargesum: 0.00000
title: Mulliken charges with hydrogens summed into heavy atoms:
elementType: N C C C C C C C C C C C C C
charge: -0.109532 0.303258 0.232144 -0.054715 -0.050221 0.083022 -0.089367 -0.098232 -0.086290 -0.129997 0.231272 0.012021 0.024806 -0.268169
polarizability: 1.60941967e+02 -3.73070484e+00 1.49614743e+02 -1.72740197e+00 -1.57862344e-01 1.24277041e+02
1716.lowfreq: -28.6932 -14.4540 -0.0005 -0.0003 0.0001 9.6661 19.7125 28.8255 45.8796
frequency: 8.3718 27.6448 44.9153 54.1322 81.1486 127.2486 153.6650 162.5444 186.9355 202.0401 223.9541 234.2198 239.9288 252.0919 254.0612 257.4824 287.7211 300.8331 321.1737 346.8867 353.9992 389.0710 400.9475 427.3670 438.0955 461.6287 510.5575 536.1859 567.0534 627.7049 654.5432 727.1675 779.6529 836.9433 855.5905 875.8486 896.3896 920.4215 924.3630 933.2120 934.4762 972.0475 1005.6740 1012.3069 1020.9737 1029.8321 1049.6617 1089.2531 1091.0180 1094.3580 1125.8128 1139.0092 1177.4466 1197.4855 1210.3046 1231.4506 1235.4665 1249.5110 1269.8246 1290.0222 1297.5437 1312.0578 1321.0423 1342.5486 1345.4700 1371.2084 1374.7535 1385.8557 1400.2063 1416.6906 1442.0674 1455.8408 1457.5223 1459.6276 1464.1943 1465.5625 1468.8785 1470.9499 1475.3923 1479.3829 1481.8607 1483.6690 1486.1032 1487.6002 1494.6338 2131.7819 2801.7190 2843.7521 2861.7671 2948.0339 2959.8791 2962.9049 2964.8461 2969.9622 2989.9646 2998.3336 3006.6801 3035.8749 3039.8084 3053.7190 3056.8616 3057.1282 3059.1321 3063.3356 3064.7105 3065.6783 3067.1119 3069.4482 3095.1989 3100.7356 3426.0683
redmass: 3.2673 3.0026 2.9613 2.9127 2.8732 2.9863 2.7434 2.6223 1.1174 1.4691 1.4265 1.3473 1.0921 1.6353 1.4894 1.2300 2.0576 2.4753 2.8545 2.3301 2.1339 2.1715 2.2294 2.3975 2.5983 2.6688 2.7486 3.5566 3.1429 1.2185 1.2483 3.2501 2.9848 2.4557 2.6016 1.8777 2.2807 1.6501 1.6285 1.2281 1.5118 1.8595 1.5689 1.4531 2.0348 1.5264 2.4528 1.9315 2.0283 1.3784 1.5661 1.7189 1.4933 2.2360 2.4502 2.0441 2.0813 2.7175 1.5267 1.3875 1.3181 1.4905 1.2979 1.4370 1.4339 1.2116 1.2174 1.2060 1.2137 1.1378 1.1707 1.0685 1.0520 1.0636 1.0519 1.0543 1.0547 1.0506 1.0557 1.0489 1.0527 1.0537 1.0624 1.0506 1.0613 6.0476 1.0781 1.0579 1.0571 1.0594 1.0349 1.0350 1.0363 1.0368 1.0683 1.0825 1.0924 1.0733 1.0717 1.1003 1.0998 1.0996 1.0991 1.0989 1.0990 1.0991 1.0994 1.0988 1.0996 1.0997 1.1583
irintensity: 0.2239 0.0743 0.1774 0.6453 0.2116 0.4231 0.1041 0.4192 0.0465 1.5315 0.0858 1.6436 0.3327 1.6282 0.5518 0.0707 0.4146 0.6371 3.1458 0.1395 0.2945 0.0217 0.5110 1.5055 0.6599 2.0314 1.2021 0.6960 2.0677 78.2775 65.2161 1.8740 4.5695 6.7127 15.8934 1.9337 0.3820 3.1317 0.4801 0.5121 8.2905 20.4942 11.1516 0.9821 32.4063 12.5655 0.0778 0.7889 5.5014 3.8841 3.1062 3.0628 7.7612 24.0101 3.1953 5.1210 0.9100 18.3580 1.4710 4.7063 6.3737 13.1428 10.6154 10.0933 4.7956 20.8142 26.7885 16.3853 15.2528 1.2339 9.9988 2.2534 0.4201 1.8223 2.8120 13.3613 8.1709 3.2282 1.6248 9.1543 24.5250 12.1961 14.1564 25.9570 18.2063 1.5269 59.9981 72.2667 189.5872 27.1590 44.6199 40.5912 43.4343 9.4166 6.7395 20.4599 35.7156 29.6941 55.3282 2.3186 5.6112 3.7795 48.0112 32.8741 42.6539 109.9700 104.7168 35.2479 31.1059 24.7698 57.4115
temp: 298.150 k
press: 1.00000 atm
elementType: 7 6 6 6 6 6 6 6 6 6 6 6 6 6 1 1 1 1 1 1 1 1 1 1 1 1 1 1 1 1 1 1 1 1 1 1 1 1 1
symmnumber: 1
zpe: 913018.5 jmol-1
zpe.correction: 0.347750 hartree
zpe.thermalcorrener: 0.366423 hartree
zpe.thermalcorrenthalpy: 0.367367 hartree
zpe.thermalcorrgfe: 0.299997 hartree
zpe.sumelectzpe: -563.886462 hartree
zpe.sumelectthermal: -563.867790 hartree
zpe.sumelectthermalent: -563.866846 hartree
zpe.sumelectthermalfe: -563.934215 hartree
dipole: 0.2964 -0.7043 0.7248
dipole: 1.0532
quadrupole: -86.9006 -85.4901 -93.5796
quadrupole: -2.8239 1.0933 0.2577
quadrupole: 1.7561 3.1667 -4.9228 -2.8239 1.0933 0.2577
hfenergy: -564.2342127 hartree
pointgroup: C01 [X(C13H25N1)]
dipole: 0.0974004 -0.378857 0.1366806 debye
polarizability: 160.9977464|-3.6296545|144.8341981|-1.0920473|9.95253|129.0018074 unknown
InChI: InChI=1S/C13H25N/c1-8-12(14(6)7)9-11(2)10-13(3,4)5/h1,11-12H,9-10H2,2-7H3
charge 0 multiplicity 1
39 atoms
N  2.904046 -0.172161 -0.465815
C  -2.991944 0.193415 -0.430147
C  -0.798499 -0.718346 0.776738
C  -2.087333 -1.025916 -0.051039
C  0.45332 -0.725222 -0.14342
C  1.767291 -0.203616 0.516112
C  -3.587872 0.838798 0.850728
C  -4.157921 -0.331431 -1.312357
C  -2.200894 1.264777 -1.227567
C  -0.64557 -1.7182 1.951098
C  1.545044 1.144429 1.09215
C  3.178204 -1.49913 -1.061719
C  4.137628 0.394193 0.131071
C  1.321293 2.248222 1.594268
H  -0.891855 0.294659 1.213949
H  -2.720824 -1.738046 0.517324
H  -1.803283 -1.551333 -0.987557
H  0.613635 -1.766219 -0.48407
H  0.268758 -0.106576 -1.040377
H  2.026172 -0.889577 1.36903
H  -2.797835 1.229257 1.518404
H  -4.185422 0.103488 1.423061
H  -4.251237 1.684545 0.587925
H  -4.746305 -1.10179 -0.777742
H  -4.845777 0.490308 -1.588671
H  -3.776546 -0.784075 -2.247704
H  -1.372231 1.6905 -0.632978
H  -2.86845 2.098354 -1.518332
H  -1.772353 0.837195 -2.154234
H  -0.535566 -2.754827 1.575841
H  0.233866 -1.488345 2.580754
H  -1.537148 -1.690737 2.604712
H  2.335686 -1.835595 -1.686609
H  3.391321 -2.291899 -0.298267
H  4.062918 -1.413956 -1.716514
H  4.918403 0.459481 -0.646933
H  4.538814 -0.219224 0.97811
H  3.937224 1.410373 0.50632
H  1.136141 3.214625 2.026161
