program: Gaussian 09
title: 000221564
version: EM64L-G09RevD.01
frameworkgroup: C1[X(C12H25NO)]
method: RPBEPBE
basis: SDD
operation: Freq
keyword: #p
keyword: freq=noraman
keyword: PBEPBE/SDD
title: #p freq=noraman PBEPBE/SDD
converged: NO YES NO NO
title: Mulliken charges:
elementType: O N C C C C C C C C C C C C H H H H H H H H H H H H H H H H H H H H H H H H H
charge: -0.183254 -0.109367 -0.032139 -0.104136 -0.419182 -0.435068 -0.371601 0.159130 -0.355469 -0.712074 -0.636597 -0.641451 -0.810119 -0.700626 0.194421 0.187533 0.205394 0.249406 0.212803 0.212296 0.178724 0.185016 0.200140 0.198459 0.215926 0.219801 0.208725 0.254487 0.180236 0.223398 0.219655 0.189052 0.241872 0.247081 0.241410 0.254145 0.208128 0.215926 0.207920
chargesum: 0.00000
title: Mulliken charges with hydrogens summed into heavy atoms:
elementType: O N C C C C C C C C C C C C
charge: -0.183254 -0.109367 0.162282 0.083397 0.035619 -0.009969 -0.007861 0.159130 0.043130 -0.067623 0.021524 0.009128 -0.067483 -0.068651
polarizability: 1.55776346e+02 2.85405167e+00 1.37500022e+02 3.74366218e-01 -7.93954726e-01 1.27075062e+02
1716.lowfreq: -7.4790 -5.7216 -0.0004 -0.0003 0.0004 13.3463 36.2703 49.6117 55.4718
frequency: 36.1756 49.5421 55.4109 63.3039 76.9652 90.3419 112.0190 124.1703 146.1721 161.4293 173.0361 174.2437 217.6941 222.7136 234.3244 241.9355 250.3454 274.7458 302.9013 335.0055 354.8469 389.2433 406.4072 465.8126 483.3376 510.9351 589.3436 640.8937 723.2155 764.3184 778.6965 807.1665 830.4440 867.8695 891.5632 925.1992 947.2946 953.7886 994.0791 1021.7478 1026.2539 1032.3606 1038.3689 1052.7883 1064.0550 1074.8484 1090.2056 1109.7919 1122.8833 1134.0518 1167.6736 1171.4241 1209.3703 1212.9625 1226.8341 1244.3264 1255.5686 1272.0069 1281.5159 1286.1871 1311.4132 1318.7315 1331.5845 1347.6514 1352.7570 1365.2846 1370.8974 1388.9921 1390.8366 1419.4137 1440.3080 1446.9151 1450.6966 1462.0905 1466.6981 1468.7737 1471.5789 1476.8259 1477.1782 1478.2197 1478.5648 1480.5640 1487.0019 1487.4545 1489.6362 1635.4124 2815.8188 2838.8654 2856.1705 2942.0080 2961.2893 2969.7894 2971.1426 2976.0050 2977.3299 2978.7190 2984.2197 2989.6068 3022.4020 3024.4073 3031.6539 3033.6923 3052.3458 3060.8968 3066.9610 3068.7775 3069.9544 3072.4831 3086.5000 3091.0226 3119.0062
redmass: 3.4598 2.9690 2.7989 1.6400 3.5980 2.6522 1.9456 2.0498 1.3599 3.8827 2.2730 1.4035 1.4364 1.2440 1.5257 1.3977 2.0554 2.1266 2.6615 3.1552 3.0104 2.6993 2.5257 2.4634 2.8543 3.0633 3.1094 2.6276 1.0937 1.4708 1.2558 2.4316 3.5238 1.8933 1.8333 1.3884 2.0436 1.7762 2.1997 2.7133 1.6615 1.5642 1.8858 2.4631 1.9591 2.3862 1.2990 2.0999 1.9150 1.5604 2.2469 2.5055 1.6018 2.1134 1.4764 2.0484 1.3718 1.3221 1.2172 1.1035 1.2277 1.2331 1.4058 1.4782 1.5523 1.2290 1.4866 1.2180 1.2068 1.1401 1.0773 1.1400 1.0807 1.0670 1.0555 1.0640 1.0531 1.0482 1.0431 1.0575 1.0507 1.0580 1.0539 1.0816 1.0736 7.5682 1.0792 1.0580 1.0582 1.0592 1.0795 1.0461 1.0493 1.0361 1.0378 1.0611 1.0933 1.0670 1.1019 1.0994 1.0713 1.0716 1.1012 1.0947 1.1007 1.0994 1.0992 1.0987 1.1001 1.1001 1.1005
irintensity: 0.9532 1.7432 1.8440 0.3117 1.9030 0.1778 1.1690 0.0602 0.2930 0.9634 0.9493 0.6773 0.3077 0.2996 1.4084 0.2080 2.1940 1.5268 0.7507 5.4351 0.4231 1.4111 1.3120 0.2514 1.8906 1.0252 6.0062 9.3071 7.4709 3.2556 3.5486 1.0984 18.7802 0.5590 5.4957 3.1485 20.2547 3.2021 21.5385 11.8924 1.0216 11.2433 9.4800 8.9342 1.9036 0.2548 3.4022 12.1420 2.9399 10.3037 2.5901 69.9925 16.8428 6.2470 6.3367 3.5109 1.4247 6.1147 2.6680 1.2150 7.3028 0.8816 5.6874 4.4112 4.0012 59.1632 5.2819 12.4492 22.0658 2.0574 14.9662 1.7957 20.3457 1.2047 11.6614 8.1817 2.3316 10.6308 7.4948 4.8209 10.5310 6.5131 32.8677 17.8889 5.2643 76.9248 72.0293 80.7086 199.4716 20.0169 11.1344 62.5513 18.9353 41.7629 2.0809 15.2783 10.8198 48.0001 17.2661 19.3192 26.3444 45.6753 20.2843 10.1010 91.3425 51.4379 55.9204 68.1887 25.1319 38.0941 14.4510
temp: 298.150 k
press: 1.00000 atm
elementType: 8 7 6 6 6 6 6 6 6 6 6 6 6 6 1 1 1 1 1 1 1 1 1 1 1 1 1 1 1 1 1 1 1 1 1 1 1 1 1
symmnumber: 1
zpe: 915853.2 jmol-1
zpe.correction: 0.348830 hartree
zpe.thermalcorrener: 0.367547 hartree
zpe.thermalcorrenthalpy: 0.368492 hartree
zpe.thermalcorrgfe: 0.301794 hartree
zpe.sumelectzpe: -601.046551 hartree
zpe.sumelectthermal: -601.027834 hartree
zpe.sumelectthermalent: -601.026889 hartree
zpe.sumelectthermalfe: -601.093587 hartree
dipole: 1.4277 1.0009 -2.9787
dipole: 3.4515
quadrupole: -84.5982 -86.5130 -96.3725
quadrupole: 0.2481 -1.9220 3.8405
quadrupole: 4.5630 2.6482 -7.2113 0.2481 -1.9220 3.8405
hfenergy: -601.395381 hartree
pointgroup: C01 [X(C12H25N1O1)]
dipole: 0.5253681 -0.4942911 1.1504839 debye
polarizability: 155.0814933|-4.4833803|138.2356|-0.711687|-0.2663332|127.0343358 unknown
InChI: InChI=1S/C12H25NO/c1-6-8-9-11(7-2)12(10(3)14)13(4)5/h11-12H,6-9H2,1-5H3
charge 0 multiplicity 1
39 atoms
O  1.344322 0.125806 -2.135226
N  1.352171 1.418497 0.534687
C  -0.174028 -0.61683 0.523156
C  1.281207 -0.054114 0.32217
C  -1.212723 0.09687 -0.385805
C  -0.241566 -2.163334 0.366934
C  -2.641039 0.092967 0.207662
C  1.799508 -0.418602 -1.096492
C  -3.682506 0.738883 -0.734836
C  0.482073 -2.96481 1.473203
C  2.705237 1.956919 0.27266
C  0.8515 1.849662 1.856505
C  2.887114 -1.484086 -1.171419
C  -5.103653 0.77409 -0.132673
H  -0.439345 -0.402737 1.580583
H  1.948038 -0.578492 1.058741
H  -1.223307 -0.385078 -1.38342
H  -0.880758 1.138159 -0.555174
H  0.138915 -2.457278 -0.631976
H  -1.311104 -2.45076 0.373021
H  -2.638694 0.640658 1.174942
H  -2.963386 -0.9441 0.440761
H  -3.355908 1.76908 -0.98276
H  -3.697661 0.181556 -1.693522
H  0.090411 -2.692965 2.471857
H  0.33152 -4.051669 1.337622
H  1.572132 -2.779391 1.48517
H  2.995019 1.761198 -0.773366
H  3.492315 1.529775 0.94718
H  2.695081 3.051885 0.414026
H  1.000049 2.939725 1.95184
H  1.374086 1.354481 2.715259
H  -0.229172 1.65356 1.950772
H  2.577407 -2.404029 -0.641659
H  3.801186 -1.11935 -0.662795
H  3.120795 -1.719098 -2.221606
H  -5.120926 1.353431 0.81007
H  -5.827159 1.239018 -0.827552
H  -5.463452 -0.247196 0.096057
