program: Gaussian 09
title: 000221563
version: EM64L-G09RevD.01
frameworkgroup: C1[X(C12H24O3)]
method: RPBEPBE
basis: SDD
operation: Freq
keyword: #pfreq=noraman
keyword: PBEPBE/SDD
title: #p freq=noraman PBEPBE/SDD
converged: YES YES NO NO
title: Mulliken charges:
elementType: O O O C C C C C C C C C C C C H H H H H H H H H H H H H H H H H H H H H H H H
charge: -0.270549 -0.414169 -0.244383 0.306217 -0.005523 -0.432043 -0.483994 0.009272 -0.764693 -0.726912 -0.723088 -0.711065 -0.526158 0.174516 -0.516594 0.177070 0.198086 0.193827 0.231826 0.202931 0.218127 0.212513 0.240257 0.211802 0.206891 0.207116 0.214310 0.211564 0.208213 0.209542 0.229599 0.206240 0.192799 0.276651 0.247943 0.211231 0.214717 0.230491 0.375420
chargesum: 0.00000
title: Mulliken charges with hydrogens summed into heavy atoms:
elementType: O O O C C C C C C C C C C C C
charge: -0.270549 -0.038749 -0.244383 0.306217 0.171546 -0.040130 -0.049237 0.227399 -0.100121 -0.098595 -0.093769 -0.082427 -0.001564 0.174516 0.139846
polarizability: 1.56776141e+02 -2.56693462e+00 1.38958503e+02 -3.79518132e-01 -2.78464667e+00 1.25644557e+02
1716.lowfreq: -9.8804 -8.4721 -0.0003 0.0004 0.0005 3.9956 19.7876 33.5973 47.9916
frequency: 19.5289 33.2986 47.9018 50.0835 65.0906 92.7894 120.5459 142.3532 175.2338 185.5799 196.6155 217.3199 234.4464 240.1832 248.3776 271.1177 285.0954 298.1702 329.1612 339.0208 348.4349 381.6846 391.6501 413.5712 447.3353 453.8822 504.6545 509.9445 531.5169 606.0311 656.7593 728.7657 799.5323 824.2356 854.7231 862.6380 882.3494 914.1756 923.8246 926.0904 937.4608 954.0485 958.7989 983.5264 1006.1860 1014.2738 1036.6222 1060.2229 1077.8985 1105.1801 1112.4591 1115.4783 1136.2875 1171.1417 1181.0458 1189.8530 1204.6409 1221.4469 1244.2961 1252.5726 1276.1616 1289.6509 1300.2707 1316.3799 1324.2460 1345.1133 1352.7404 1363.5247 1371.1753 1374.7156 1386.3003 1399.7991 1421.6173 1438.2379 1457.2694 1458.3940 1460.1350 1463.0973 1465.9055 1468.8377 1477.6237 1478.2165 1479.3064 1484.5056 1487.3085 1496.8652 1654.2111 2934.7716 2952.9277 2961.3421 2962.1593 2962.9417 2965.1658 2970.2428 2971.0608 2981.0144 2995.5007 3008.4373 3013.7207 3041.1543 3054.7587 3056.3405 3059.5979 3060.0720 3063.9770 3067.5645 3070.2605 3077.9419 3085.1976 3099.1097 3503.6729
redmass: 4.6468 3.7727 4.8967 3.2525 4.5033 2.7221 2.6890 3.9206 2.6931 2.4863 1.1420 1.1492 1.6163 1.1000 1.6111 1.9628 1.1535 2.4590 2.4847 2.3209 2.8854 2.4065 2.0794 2.4767 2.0556 3.1567 3.0315 2.2628 2.7321 3.2646 1.4645 3.1561 3.1099 2.1906 2.0644 2.0540 2.4797 2.0452 1.6997 1.6971 1.2112 2.5531 1.7600 2.1822 1.4637 1.4232 3.2289 2.4220 1.9557 2.2473 2.1431 1.2978 1.8429 1.6369 1.3131 1.4765 1.8463 1.7980 1.6367 2.4468 1.3557 1.5871 1.4611 1.3931 1.3874 1.4246 1.4722 1.5888 1.2072 1.2075 1.2071 1.2122 1.1062 1.1289 1.0607 1.0619 1.0594 1.0628 1.0593 1.0636 1.0519 1.0524 1.0538 1.0601 1.0545 1.0614 8.0599 1.0342 1.0636 1.0612 1.0393 1.0761 1.0496 1.0370 1.0384 1.0611 1.0642 1.1007 1.1016 1.1012 1.0993 1.0998 1.0995 1.0994 1.0987 1.0983 1.0990 1.0954 1.0975 1.0984 1.0638
irintensity: 0.1916 0.5432 0.7308 0.3251 1.3361 1.6534 6.0116 2.5360 0.9915 0.0608 0.1536 0.9620 0.8884 0.2668 2.1793 0.4346 0.2547 0.8033 0.1194 0.3879 0.6135 2.5331 3.7655 1.6912 0.7557 3.7317 8.7836 32.7309 15.0035 15.8490 134.2251 1.1239 17.5526 3.5436 3.0223 4.3879 13.7505 6.3444 0.5364 0.8416 0.0974 7.4764 6.9075 14.9461 1.6798 0.6337 101.8422 201.7717 86.4549 27.2181 7.9212 0.0256 5.5309 4.9264 16.2776 20.8700 3.9023 8.1973 6.7776 8.5677 0.7977 11.1411 8.2892 24.5127 2.0131 7.6537 43.0191 31.4275 22.7195 20.7017 17.1262 9.8777 24.7321 3.8404 1.2756 11.6901 1.6854 1.0359 6.7796 3.7541 1.2461 15.6908 14.5776 17.1685 5.7831 33.0993 184.5201 67.9910 9.3353 10.6636 55.7355 37.4634 41.3308 30.7096 11.1664 56.2377 3.7340 36.8680 52.0609 19.0049 15.8076 7.1237 30.8222 42.0756 69.9373 87.4351 85.0914 4.9442 30.7041 34.4779 25.1728
temp: 298.150 k
press: 1.00000 atm
elementType: 8 8 8 6 6 6 6 6 6 6 6 6 6 6 6 1 1 1 1 1 1 1 1 1 1 1 1 1 1 1 1 1 1 1 1 1 1 1 1
symmnumber: 1
zpe: 895570.5 jmol-1
zpe.correction: 0.341105 hartree
zpe.thermalcorrener: 0.360226 hartree
zpe.thermalcorrenthalpy: 0.361171 hartree
zpe.thermalcorrgfe: 0.292970 hartree
zpe.sumelectzpe: -696.092285 hartree
zpe.sumelectthermal: -696.073163 hartree
zpe.sumelectthermalent: -696.072219 hartree
zpe.sumelectthermalfe: -696.140420 hartree
dipole: 0.2891 -0.6334 -0.8716
dipole: 1.1156
quadrupole: -88.5181 -98.5921 -94.5907
quadrupole: -5.6499 0.4703 1.6241
quadrupole: 5.3822 -4.6918 -0.6904 -5.6499 0.4703 1.6241
hfenergy: -696.4333896 hartree
pointgroup: C01 [X(C12H24O3)]
dipole: 0.0978627 -0.2886596 -0.3158186 debye
polarizability: 156.6965902|-2.781236|138.0852485|-1.6406368|-4.1623473|126.5973628 unknown
InChI: InChI=1S/C12H24O3/c1-9(8-12(2,3)4)6-10(15-5)7-11(13)14/h9-10,13H,6-8H2,1-5H3
charge 0 multiplicity 1
39 atoms
O  2.100703 1.853389 0.632582
O  3.332623 -1.593848 -1.447753
O  1.929981 -1.890739 0.37666
C  -2.843928 -0.670269 0.508954
C  -1.413818 1.227124 -0.721806
C  -2.107945 0.709556 0.577925
C  -0.04911 1.906836 -0.413324
C  1.067936 0.963413 0.068632
C  -2.310496 2.232005 -1.489484
C  -3.962117 -0.668493 -0.567104
C  -3.486014 -0.930043 1.899687
C  -1.841475 -1.815917 0.201319
C  1.644237 0.092941 -1.079096
C  2.277037 -1.200302 -0.60918
C  3.178782 1.157358 1.337078
H  -1.231764 0.361753 -1.393927
H  -2.838021 1.47661 0.912344
H  -1.358283 0.633088 1.3918
H  -0.195348 2.667955 0.37754
H  0.31105 2.44993 -1.31031
H  0.69576 0.288498 0.869558
H  -2.452182 3.154549 -0.893736
H  -3.309239 1.811537 -1.698222
H  -1.853558 2.523072 -2.454449
H  -4.504558 -1.633253 -0.560521
H  -4.698796 0.135851 -0.379241
H  -3.54956 -0.525935 -1.582965
H  -2.716242 -0.95362 2.694491
H  -4.214915 -0.137222 2.155316
H  -4.018641 -1.899746 1.914388
H  -1.000524 -1.829187 0.919632
H  -2.350713 -2.796881 0.254674
H  -1.412573 -1.724988 -0.814488
H  2.369258 0.674811 -1.673595
H  0.818718 -0.192153 -1.761368
H  3.845388 0.608888 0.638571
H  2.781517 0.442538 2.086814
H  3.764241 1.941642 1.84283
H  3.69329 -2.466046 -1.128027
