program: Gaussian 09
title: 000221560
version: EM64L-G09RevD.01
frameworkgroup: C1[X(C12H23N)]
method: RPBEPBE
basis: SDD
operation: Freq
keyword: #pfreq=noraman
keyword: PBEPBE/SDD
title: #p freq=noraman PBEPBE/SDD
converged: YES YES NO NO
title: Mulliken charges:
elementType: N C C C C C C C C C C C C H H H H H H H H H H H H H H H H H H H H H H H
charge: -0.125078 0.335749 -0.397132 -0.178148 -0.775937 -0.770951 -0.393005 -0.354237 0.206586 -0.653341 -0.628442 -0.701439 -0.544356 0.183082 0.218402 0.223006 0.214186 0.213944 0.234817 0.212287 0.212531 0.237168 0.202160 0.197186 0.198284 0.192438 0.247331 0.213905 0.216677 0.221011 0.209615 0.217956 0.209265 0.208283 0.215675 0.280520
chargesum: 0.00000
title: Mulliken charges with hydrogens summed into heavy atoms:
elementType: N C C C C C C C C C C C C
charge: -0.125078 0.335749 0.004352 0.044858 -0.112991 -0.108964 0.006341 0.036485 0.206586 0.024572 0.020140 -0.068216 -0.263836
polarizability: 1.61107774e+02 4.99554711e+00 1.28756742e+02 7.75126842e+00 2.70221421e+00 1.17016039e+02
1716.lowfreq: -11.6303 -8.2718 -0.0007 -0.0006 0.0008 17.9396 28.1312 50.6883 61.9644
frequency: 27.5191 50.4403 61.7506 76.2897 111.4640 117.9933 137.0411 170.4292 187.8748 195.8308 223.5144 234.5176 243.5297 262.2228 269.1921 290.9969 305.1533 329.4605 340.5360 349.2778 384.9902 418.7991 465.2234 492.0852 559.9291 584.9290 624.3265 636.4657 726.3814 770.6229 780.5622 815.8304 885.4005 896.2598 908.3368 934.8944 952.5992 964.0860 998.2121 1021.7289 1038.4825 1040.4996 1068.4197 1080.2130 1086.7641 1097.2562 1140.6359 1146.1103 1180.0128 1196.8309 1225.4208 1237.8521 1250.7815 1265.6193 1276.5806 1294.7156 1309.7487 1334.4952 1350.9373 1360.5734 1373.7025 1389.7345 1392.4205 1419.6806 1437.5794 1445.1224 1457.4787 1464.0567 1466.3982 1470.3168 1474.7387 1475.2347 1476.7797 1478.4110 1484.1057 1487.0411 1491.5526 1499.4030 2107.4303 2882.0983 2898.8908 2957.0279 2961.6147 2970.3536 2970.9173 2973.4210 2975.5948 2982.0695 3000.9575 3019.2916 3020.2704 3032.3062 3042.2752 3062.2412 3067.4388 3069.5235 3070.3621 3074.5059 3075.0265 3080.3721 3120.2013 3424.4278
redmass: 3.1034 2.8828 1.7181 2.7540 2.7369 3.4901 2.6772 2.0596 2.2928 1.1868 1.1690 1.0947 1.2165 2.0078 2.5605 1.3608 2.6221 2.4125 3.7951 2.3550 3.7591 2.3085 2.8364 2.8486 3.5819 3.7564 1.2379 1.2394 1.1078 1.6191 2.2313 3.4809 2.5728 1.7522 1.5066 1.4897 2.0579 2.4435 1.3592 2.1350 2.6555 1.8993 1.5504 2.1975 1.2504 2.0790 1.5625 2.0688 2.2532 2.0367 2.8266 1.5470 2.3046 1.3797 1.4508 1.1757 1.1706 1.4364 1.3684 1.4593 1.2044 1.2141 1.2056 1.1367 1.0993 1.1366 1.0471 1.0660 1.0536 1.0554 1.0550 1.0672 1.0465 1.0427 1.0552 1.0770 1.0535 1.0548 6.0502 1.0529 1.0546 1.0617 1.0578 1.0499 1.0398 1.0422 1.0390 1.0784 1.0968 1.0771 1.0992 1.0805 1.1025 1.0990 1.1007 1.0993 1.0987 1.1007 1.0996 1.0995 1.0949 1.1566
irintensity: 0.1080 0.1164 0.1004 0.0624 0.0107 0.4392 0.0872 0.8200 1.3513 0.3782 0.3561 0.0710 0.1370 0.3215 0.3231 0.4346 0.2841 2.6753 14.5845 0.6876 3.4903 3.1585 0.8174 4.9298 5.8592 6.5090 70.5130 64.4272 13.1561 0.6008 4.1851 6.6112 1.0509 6.6336 1.6385 2.4565 26.7423 10.5472 4.8336 58.2602 8.5520 21.7690 1.1480 3.5386 3.3249 3.6880 1.4096 9.0516 4.3400 2.6367 7.1176 3.1521 2.9470 1.6251 2.8201 2.7072 3.7506 1.3137 7.4168 1.0415 22.8270 15.0233 16.9340 5.9748 3.6089 7.8593 9.5213 0.2821 11.2281 7.6557 10.5225 6.3853 2.0442 12.3670 9.9671 9.8742 13.0304 15.7405 6.5744 80.6296 118.9352 9.4353 3.3172 35.9527 35.0783 90.1258 19.7975 19.9923 2.0796 36.7648 6.2074 40.8058 41.1077 23.2674 97.6100 53.6106 53.1678 19.5062 51.4217 46.5086 16.1865 65.4770
temp: 298.150 k
press: 1.00000 atm
elementType: 7 6 6 6 6 6 6 6 6 6 6 6 6 1 1 1 1 1 1 1 1 1 1 1 1 1 1 1 1 1 1 1 1 1 1 1
symmnumber: 1
zpe: 842236.9 jmol-1
zpe.correction: 0.320791 hartree
zpe.thermalcorrener: 0.338117 hartree
zpe.thermalcorrenthalpy: 0.339062 hartree
zpe.thermalcorrgfe: 0.276323 hartree
zpe.sumelectzpe: -524.665579 hartree
zpe.sumelectthermal: -524.648252 hartree
zpe.sumelectthermalent: -524.647308 hartree
zpe.sumelectthermalfe: -524.710046 hartree
dipole: -0.0752 0.4511 0.0628
dipole: 0.4616
quadrupole: -81.8128 -81.4055 -84.1159
quadrupole: -1.3303 -0.1580 -0.2109
quadrupole: 0.6320 1.0392 -1.6712 -1.3303 -0.1580 -0.2109
hfenergy: -524.9863696 hartree
pointgroup: C01 [X(C12H23N1)]
dipole: -0.0359979 -0.1757551 -0.0282065 debye
polarizability: 161.3873615|-6.6119109|129.249245|-4.7661351|2.7088624|116.2439477 unknown
InChI: InChI=1S/C12H23N/c1-7-9-10-12(3,4)11(8-2)13(5)6/h2,11H,7,9-10H2,1,3-6H3
charge 0 multiplicity 1
36 atoms
N  -0.985286 -1.299698 -0.501654
C  -0.153163 1.163134 -0.319847
C  1.256831 0.661357 -0.759485
C  -0.967653 -0.042053 0.311504
C  -0.852661 1.7909 -1.555749
C  -0.039297 2.264143 0.772257
C  2.181344 0.093231 0.340359
C  3.564895 -0.317754 -0.216287
C  -2.332903 0.357672 0.752561
C  -2.010698 -1.383521 -1.567603
C  -1.011178 -2.515956 0.344081
C  4.503538 -0.896029 0.86445
C  -3.499976 0.589925 1.083415
H  1.773537 1.512355 -1.252714
H  1.110428 -0.122482 -1.527582
H  -0.405568 -0.302784 1.231286
H  -0.762277 1.148036 -2.449158
H  -0.37458 2.758272 -1.800125
H  -1.923697 1.98277 -1.360663
H  0.634035 3.070393 0.426042
H  0.362807 1.869964 1.72374
H  -1.027357 2.709712 0.98592
H  2.329129 0.836845 1.149578
H  1.712402 -0.79781 0.805269
H  3.42284 -1.063789 -1.024488
H  4.042575 0.56495 -0.689189
H  -1.985382 -0.489164 -2.20611
H  -3.047568 -1.490025 -1.168798
H  -1.790236 -2.263566 -2.199135
H  -0.884012 -3.405764 -0.298918
H  -1.962961 -2.637712 0.916391
H  -0.172892 -2.493921 1.063195
H  4.687346 -0.156658 1.667023
H  4.061201 -1.795507 1.333431
H  5.482975 -1.184029 0.439865
H  -4.506638 0.817864 1.382439
