program: Gaussian 09
title: 000221551
version: EM64L-G09RevD.01
frameworkgroup: C1[X(C10H18N4)]
method: RPBEPBE
basis: SDD
operation: Freq
keyword: #pfreq=noraman
keyword: PBEPBE/SDD
title: #p freq=noraman PBEPBE/SDD
converged: YES YES NO NO
title: Mulliken charges:
elementType: N N N N C C C C C C C C C C H H H H H H H H H H H H H H H H H H
charge: -0.095986 -0.086710 -0.017052 -0.017518 -0.393373 -0.338845 -0.350638 -0.327084 -0.633175 -0.631931 -0.430398 -0.432806 -0.151348 -0.151701 0.213866 0.216838 0.197788 0.214576 0.214522 0.231467 0.205621 0.229517 0.233284 0.219138 0.200670 0.239018 0.218000 0.199123 0.265279 0.248306 0.265896 0.245655
chargesum: 0.00000
title: Mulliken charges with hydrogens summed into heavy atoms:
elementType: N N N N C C C C C C C C C C
charge: -0.095986 -0.086710 -0.017052 -0.017518 0.037331 0.073518 0.095351 0.108055 0.019918 0.024210 0.083187 0.078745 -0.151348 -0.151701
polarizability: 1.53521341e+02 -4.06905093e+00 1.40707792e+02 -4.66836009e+00 -5.75173073e-01 9.87662318e+01
1716.lowfreq: -8.0749 -4.7269 -0.0006 -0.0005 -0.0004 5.4956 21.0789 25.3344 38.3773
frequency: 20.5731 25.1457 38.2730 48.5842 53.6114 87.4467 105.8362 123.8507 129.8986 164.6321 198.1565 206.5198 230.8667 257.3698 293.7299 323.6592 342.6526 353.8345 375.8491 382.7082 424.5370 458.9272 495.4827 515.3342 558.3952 765.0605 772.7197 794.2046 818.7276 851.6488 938.7192 939.8683 1002.2815 1016.1852 1023.6258 1029.4841 1035.7370 1041.6568 1058.9156 1078.2587 1107.4955 1115.2199 1128.9960 1148.5326 1168.6780 1225.0656 1235.1660 1244.1119 1257.1699 1276.6036 1279.6303 1293.5768 1306.5596 1310.3043 1332.2134 1360.7657 1365.9057 1393.6341 1435.9976 1438.0288 1444.0064 1444.6848 1459.4451 1470.8170 1473.6717 1476.7936 1478.4394 1480.9829 1485.8733 1487.8845 2197.2513 2197.7135 2871.4609 2873.8372 2876.8860 2890.7321 2893.0548 2905.9061 3006.6458 3007.4640 3020.7447 3027.3632 3040.8835 3044.3035 3047.3393 3050.9854 3071.8042 3072.2473 3082.2923 3091.6154
redmass: 3.8426 8.3644 2.4260 3.5897 3.1115 2.7595 3.1567 2.2555 3.9061 2.0859 1.9040 1.1764 2.3263 3.4659 2.8747 3.0425 2.8054 2.8845 3.5686 3.0162 2.9544 3.1490 3.5851 5.5832 3.9015 1.2173 1.2129 1.3319 4.0115 3.9546 4.5571 4.6516 3.6440 3.1769 1.9447 1.6579 1.9679 2.5710 2.1067 2.7118 1.3477 1.3859 2.3284 1.5617 1.3360 1.9948 1.5052 1.6719 1.4958 1.3175 1.3784 1.2171 1.3016 1.2855 1.4007 1.3377 1.2989 1.3193 1.1440 1.1563 1.0897 1.0856 1.0786 1.0485 1.0599 1.0775 1.0775 1.0715 1.0616 1.0763 12.4211 12.4233 1.0576 1.0567 1.0686 1.0702 1.0699 1.0688 1.0589 1.0589 1.0875 1.0750 1.0775 1.0882 1.0906 1.0915 1.1002 1.1001 1.1002 1.1001
irintensity: 0.3194 1.4742 4.6155 4.4851 2.9753 1.1505 2.7382 1.1527 5.3791 2.3508 2.7684 0.2199 1.8574 0.8334 1.4929 0.7230 0.7137 10.2488 0.6885 8.3371 6.4167 5.4122 5.9619 7.2553 0.8814 5.7663 3.6684 8.7416 15.7723 1.6933 4.4239 4.5977 6.2058 23.5212 35.3389 6.1189 63.8379 35.2827 7.8732 2.7779 9.0877 1.4391 26.3583 31.4753 12.5669 1.6179 1.6740 21.5540 22.0717 4.5366 4.0226 4.4111 7.5745 1.7593 15.3471 8.8273 10.9658 3.3104 0.8747 8.7273 6.9708 7.1946 1.9984 14.5721 12.0621 0.9155 20.0703 12.4568 13.8998 18.2072 15.4555 17.5518 72.4855 91.6164 47.6948 109.9600 13.2813 182.9101 6.2991 6.6801 6.4529 42.2598 32.9648 14.3559 31.2645 19.3466 12.6762 30.4328 49.3285 39.4803
temp: 298.150 k
press: 1.00000 atm
elementType: 7 7 7 7 6 6 6 6 6 6 6 6 6 6 1 1 1 1 1 1 1 1 1 1 1 1 1 1 1 1 1 1
symmnumber: 1
zpe: 710460.7 jmol-1
zpe.correction: 0.270600 hartree
zpe.thermalcorrener: 0.287764 hartree
zpe.thermalcorrenthalpy: 0.288708 hartree
zpe.thermalcorrgfe: 0.222477 hartree
zpe.sumelectzpe: -609.683992 hartree
zpe.sumelectthermal: -609.666829 hartree
zpe.sumelectthermalent: -609.665884 hartree
zpe.sumelectthermalfe: -609.732115 hartree
dipole: 1.3262 -7.1797 0.1005
dipole: 7.3019
quadrupole: -119.6772 -103.1477 -86.2351
quadrupole: -0.7232 8.1871 1.6420
quadrupole: -16.6572 -0.1277 16.7849 -0.7232 8.1871 1.6420
hfenergy: -609.9545921 hartree
pointgroup: C01 [X(C10H18N4)]
dipole: -0.4855102 2.8273688 0.1520512 debye
polarizability: 152.9715416|-4.5624816|140.6960058|6.5560248|2.2745594|99.3278168 unknown
InChI: InChI=1S/C10H18N4/c1-13(7-3-5-11)9-10-14(2)8-4-6-12/h3-4,7-10H2,1-2H3
charge 0 multiplicity 1
32 atoms
N  -2.117162 1.24423 0.083794
N  1.683715 0.907354 -0.023417
N  -4.52227 -2.986199 -0.721891
N  5.419714 -2.289774 0.371211
C  -0.726591 1.594945 -0.304857
C  0.301538 0.771084 0.504499
C  -2.611829 0.003389 -0.548215
C  2.602446 -0.130609 0.494992
C  -3.066708 2.370433 -0.037213
C  2.224453 2.275588 0.140096
C  -3.614655 -0.737853 0.385201
C  3.762325 -0.39751 -0.509656
C  -4.125389 -1.980226 -0.216744
C  4.684904 -1.439857 -0.031624
H  -0.529251 1.44145 -1.392687
H  -0.587602 2.671947 -0.100323
H  0.220531 1.065528 1.58009
H  0.024144 -0.297786 0.441845
H  -3.101842 0.198431 -1.532499
H  -1.758118 -0.668582 -0.744125
H  3.033943 0.133341 1.491108
H  2.036143 -1.069621 0.625776
H  -2.698064 3.231343 0.546859
H  -4.051008 2.089513 0.377906
H  -3.225871 2.704098 -1.092385
H  1.600537 3.00166 -0.407019
H  3.241096 2.339594 -0.284182
H  2.276454 2.593373 1.211419
H  -3.107733 -0.967959 1.34009
H  -4.472285 -0.082157 0.625279
H  3.327453 -0.700656 -1.479487
H  4.340884 0.527791 -0.688738
