program: Gaussian 09
title: 000221546
version: EM64L-G09RevD.01
frameworkgroup: C1[X(C7H12O3S2)]
method: RPBEPBE
basis: SDD
operation: Freq
keyword: #p
keyword: freq=noraman
keyword: PBEPBE/SDD
title: #p freq=noraman PBEPBE/SDD
converged: NO YES NO NO
title: Mulliken charges:
elementType: S S O O O C C C C C C C H H H H H H H H H H H H
charge: 0.240462 0.071078 -0.144857 -0.407601 -0.216621 -0.368708 -0.346989 -0.301935 -0.683177 -0.362452 -0.703930 0.237280 0.217877 0.218218 0.198052 0.197946 0.235640 0.235487 0.213998 0.214021 0.220851 0.324157 0.323853 0.387349
chargesum: 0.00000
title: Mulliken charges with hydrogens summed into heavy atoms:
elementType: S S O O O C C C C C C C
charge: 0.240462 0.071078 -0.144857 -0.020252 -0.216621 0.067388 0.049010 0.169192 -0.034308 -0.362452 -0.055920 0.237280
polarizability: 1.67756871e+02 -7.98000629e+00 1.36527335e+02 -2.03900955e-01 2.40192560e-01 6.88786273e+01
1716.lowfreq: -0.0022 0.0014 0.0022 2.2192 8.0030 12.2322 22.9239 28.1794 48.5962
frequency: 22.7551 28.1602 48.5853 53.6143 63.0509 92.5286 112.5324 123.9997 148.6248 179.7304 202.2727 222.8035 253.6907 336.3275 382.6206 407.3191 480.0355 499.5763 507.7476 551.2650 566.7518 631.0412 746.0811 752.0111 809.6616 856.9492 873.3854 900.3285 902.8493 937.9126 965.1370 1038.9167 1050.8350 1082.4803 1127.4636 1132.1884 1142.0476 1172.7148 1211.7690 1229.3264 1279.9784 1283.0946 1293.7377 1325.8865 1351.7970 1374.7197 1392.1294 1404.7728 1462.3450 1471.9954 1476.3620 1477.6339 1489.8432 1669.1042 2972.6272 2979.5665 2983.0036 3004.5362 3017.5780 3041.0293 3045.3105 3071.8242 3080.7739 3082.0409 3105.5636 3516.5734
redmass: 10.0230 4.6053 2.8551 5.5085 2.0460 3.1358 6.5378 2.1146 3.5847 5.2704 8.3156 1.1647 5.7577 5.1461 11.3895 5.3156 4.6713 1.7914 11.9947 9.5741 5.1369 1.3546 1.0734 6.9518 1.1340 7.5603 4.9496 1.8343 1.9218 1.1740 8.8554 3.3293 2.2514 2.3075 2.8021 1.3774 1.1228 6.6376 1.3917 1.3464 1.2949 1.1756 1.0657 2.2110 1.4156 1.4805 1.2182 1.0792 1.0842 1.0694 1.0418 1.0597 1.0920 8.8877 1.0590 1.0363 1.0558 1.0590 1.1010 1.0583 1.1060 1.1038 1.0995 1.1041 1.1038 1.0641
irintensity: 2.8296 0.5227 0.0934 1.0364 0.5889 3.8647 5.2968 0.9475 2.9381 0.2467 1.3022 0.2103 2.9728 3.5078 4.4772 4.1838 17.3667 32.3951 0.0823 6.7033 71.1415 143.0756 10.1175 23.1698 0.0266 35.4644 19.8096 9.0020 3.9509 0.5970 266.1441 76.1669 235.3020 22.3852 10.9337 2.8087 0.3457 520.9758 0.0499 3.8548 8.8839 0.0827 0.1442 63.6707 1.8613 0.5824 10.0480 48.4061 5.8802 0.8327 13.5715 5.9246 19.2693 176.6705 24.8681 34.9153 12.1361 31.0356 10.3943 10.2202 1.1391 0.3456 45.1736 108.4389 0.0048 33.6052
temp: 298.150 k
press: 1.00000 atm
elementType: 16 16 8 8 8 6 6 6 6 6 6 6 1 1 1 1 1 1 1 1 1 1 1 1
symmnumber: 1
zpe: 481502.4 jmol-1
zpe.correction: 0.183395 hartree
zpe.thermalcorrener: 0.198523 hartree
zpe.thermalcorrenthalpy: 0.199467 hartree
zpe.thermalcorrgfe: 0.137405 hartree
zpe.sumelectzpe: -1294.768697 hartree
zpe.sumelectthermal: -1294.753569 hartree
zpe.sumelectthermalent: -1294.752625 hartree
zpe.sumelectthermalfe: -1294.814687 hartree
dipole: 0.6262 -2.4086 0.0151
dipole: 2.4887
quadrupole: -64.5424 -101.5644 -85.5421
quadrupole: -1.2924 -0.0942 -0.0713
quadrupole: 19.3406 -17.6814 -1.6591 -1.2924 -0.0942 -0.0713
hfenergy: -1294.9520915 hartree
pointgroup: C01 [X(C7H12O3S2)]
dipole: 0.203166 0.9034656 0.318095 debye
dipolederiv: -0.2316188 0.2210715 0.0746151 0.4250397 -0.4979555 -0.1657877 0.1481106 -0.170101 -0.0664688 -0.4741782 -0.2415255 -0.0930446 -0.1197727 -0.7753953 -0.2291785 -0.0495602 -0.2336301 -0.2236925 -1.9315626 -0.5587869 -0.2334836 -0.3180137 -0.5148934 -0.1148624 -0.1451889 -0.1179599 -0.2540385 -1.3973419 -0.2005467 -0.0976688 -0.171562 -0.3335386 0.0296124 -0.086521 0.0291042 -0.4190572 -0.7496135 0.1225292 0.0331307 -0.1169486 -0.810635 -0.1895958 -0.053752 -0.1840451 -0.3662447 -0.0462538 -0.0487254 -0.019529 -0.1012563 0.0158013 -0.0490662 -0.0399418 -0.047879 0.1267922 -0.0134664 -0.0149252 -0.0073578 0.1132911 0.1517873 -0.0096197 0.0400911 -0.011302 0.1785435 0.6639685 0.2191517 0.0847588 0.4448847 0.4124132 0.0251265 0.1660903 0.0199601 0.3780321 -0.0425603 -0.0071086 -0.0036417 -0.0743116 0.0458961 -0.0182676 -0.028665 -0.0175367 0.085796 1.8326973 0.3713363 0.1704206 -0.293189 1.3246295 0.4990199 -0.067507 0.5126644 0.0930284 0.1688914 -0.0180789 -0.0036735 0.3084873 -0.2536311 -0.1224178 0.1128755 -0.1291413 0.0603209 1.7809311 0.0045743 0.0411129 -0.0185596 1.0843582 0.3133765 0.031841 0.3141012 0.3377397 0.0361243 0.0023974 0.0481681 0.0292997 0.0621822 -0.0407438 0.0548378 -0.0577205 -0.1104863 0.0373003 0.0303471 -0.0343428 0.0557188 -0.0589852 0.0860056 -0.021712 0.1021345 0.0096301 0.0164093 0.0205248 0.0887303 -0.0044551 0.0456924 -0.0493687 0.0716724 -0.0800099 -0.1487326 0.0186043 0.0713465 -0.0532467 0.041728 -0.1004189 0.0915772 -0.0565076 0.1226061 -0.0042533 0.0005798 -0.0179159 0.0540389 -0.1015966 0.0028935 -0.0354581 0.0549931 -0.0486452 -0.0848402 0.0040258 0.0202564 -0.0522444 -0.0421378 -0.0733174 0.0422711 -0.1070165 0.0575797 -0.0108761 0.0465753 0.0328386 -0.017196 0.0992282 -0.0625302 0.1257993 -0.0457285 0.1189604 0.0046691 0.0449381 0.0144554 0.036729 0.0461456 0.0868339 -0.0540408 0.1017356 -0.0481419 -0.1432347 -0.0610873 -0.1115837 -0.042864 -0.147526 -0.0823167 -0.0703199 -0.0559721 -0.0698532 0.0771498 -0.0097659 0.0092531 0.0238626 -0.0777251 0.0636135 0.0553393 -0.0374525 0.0315312 0.0804404 -0.0102198 0.0250112 -0.014791 -0.0788876 0.1134017 -0.0313556 -0.0218746 -0.0033777 0.0281667 0.3166231 0.0541032 0.017517 0.1021188 0.1541144 -0.0880453 0.0351525 -0.0892983 0.3716161 unknown
polarizability: 166.9301731|8.1681011|129.4063044|4.964191|21.8771625|76.8263562 unknown
InChI: InChI=1S/C7H12O3S2/c1-2-3-4-10-7(11)12-5-6(8)9/h8H,2-5H2,1H3
charge 0 multiplicity 1
24 atoms
S  -1.07176 0.479512 -0.141026
S  -0.846612 -2.481689 -1.198487
O  1.214388 -0.916697 -0.596805
O  -5.111041 0.478219 -0.244806
O  -3.561052 2.095328 0.383147
C  3.376484 0.118092 -0.198942
C  4.169551 1.364075 0.266047
C  1.869098 0.35387 -0.12723
C  5.695866 1.141767 0.194745
C  -0.151427 -1.043305 -0.668209
C  -2.822245 -0.141214 -0.41179
C  -3.808486 0.94841 -0.041331
H  3.654344 -0.138368 -1.238438
H  3.638085 -0.751477 0.432622
H  3.882197 1.621178 1.30571
H  3.893962 2.236015 -0.361089
H  1.530909 0.559901 0.906776
H  1.547176 1.179733 -0.790825
H  6.003564 0.293846 0.83443
H  6.015816 0.916241 -0.839451
H  6.246922 2.03797 0.532026
H  -2.985231 -1.043581 0.19969
H  -2.942247 -0.437874 -1.466511
H  -5.762758 1.191045 -0.00165
