program: Gaussian 09
title: 000221537
version: EM64L-G09RevD.01
frameworkgroup: C1[X(C18H17N2PS)]
method: RPBEPBE
basis: SDD
operation: Freq
keyword: #p
keyword: freq=noraman
keyword: PBEPBE/SDD
title: #p freq=noraman PBEPBE/SDD
converged: YES YES NO NO
title: Mulliken charges:
elementType: S P N N C C C C C C C C C C C C C C C C C C H H H H H H H H H H H H H H H H H
charge: -0.198020 0.540964 -0.818031 -0.765876 0.056192 0.529542 0.514018 -0.264049 -0.315548 -0.239842 -0.214155 -0.429103 -0.415188 -0.327507 -0.336154 -0.221326 -0.195951 -0.193366 -0.226430 -0.224639 -0.262007 -0.263176 0.348602 0.342546 0.277725 0.277335 0.237388 0.235705 0.224165 0.223404 0.265741 0.241212 0.235187 0.224667 0.226511 0.226460 0.224934 0.228578 0.229490
chargesum: 0.00000
title: Mulliken charges with hydrogens summed into heavy atoms:
elementType: S P N N C C C C C C C C C C C C C C C C C C
charge: -0.198020 0.540964 -0.469429 -0.423331 0.056192 0.529542 0.514018 0.013676 -0.038213 -0.002454 0.021551 -0.204938 -0.191783 -0.061766 -0.094942 0.013861 0.028716 0.033145 0.000031 0.000295 -0.033430 -0.033686
polarizability: 2.84749099e+02 -8.27366181e+00 2.25968738e+02 6.09788825e+00 1.90307794e+01 2.37509736e+02
1716.lowfreq: -7.9764 -3.9195 -0.0006 -0.0003 0.0007 6.1142 17.4869 24.1589 34.9454
frequency: 17.4074 24.0396 34.9126 39.4882 50.9044 71.3468 92.4582 107.7942 130.8809 160.8013 178.1355 185.3852 220.3367 248.9472 260.8969 273.4988 322.4222 397.8236 400.7690 403.9711 405.5056 417.8705 472.3635 492.9542 500.9633 514.4050 535.6160 559.9669 584.9278 603.6297 610.4512 614.2540 616.7402 683.3648 691.4907 693.5333 701.4817 749.6284 757.2340 761.5583 764.7087 778.7286 823.4701 827.4703 863.0267 873.8657 878.5117 891.4150 891.7837 945.0468 960.9080 961.6731 981.4168 981.8496 982.4082 984.8930 987.4107 990.7490 1005.5168 1019.4070 1027.1236 1027.4389 1079.6260 1080.8354 1088.1465 1088.7731 1171.0578 1171.3088 1174.7827 1186.9753 1191.8194 1192.9547 1249.4870 1250.3591 1305.3278 1309.2215 1312.2067 1360.0067 1363.4267 1381.4717 1401.7400 1405.0398 1426.9569 1461.4332 1463.3369 1465.1407 1482.9027 1487.5425 1586.8425 1592.0533 1593.7448 1594.3308 1613.3128 1616.9350 3114.9548 3118.6681 3129.8788 3130.0825 3130.5214 3136.4673 3140.6284 3143.0757 3147.6707 3151.2574 3158.8371 3162.5027 3168.1047 3170.1536 3173.5924 3510.0802 3518.8994
redmass: 5.2897 4.7724 4.0453 4.9408 4.2299 4.1258 8.2807 7.2177 5.6756 6.7846 5.6479 5.8484 4.7405 4.5909 4.9067 5.6908 7.0444 5.8946 2.9119 3.0536 2.9616 5.7026 1.6445 2.4145 2.5972 2.6524 2.9541 1.9365 5.1134 6.4285 6.2944 6.3535 6.7551 6.1972 1.9540 1.8781 2.1266 3.6397 1.9351 1.9501 1.7048 4.0361 1.2611 1.2585 1.2526 4.8130 5.4903 1.5144 1.4845 1.3657 1.3750 1.3756 1.3800 2.3424 4.0399 2.0008 5.8106 1.4570 1.3279 3.0569 2.1252 2.1221 2.5000 1.6292 1.5990 1.5712 1.0493 1.0486 1.0542 1.1197 1.1156 1.1111 2.1443 1.8874 1.4214 1.6633 1.6201 1.7387 1.9309 8.8848 3.1428 2.7200 2.1225 2.0759 2.0404 2.0080 2.3932 2.4823 6.0948 5.8352 5.8886 5.8443 6.1486 6.1237 1.0876 1.0871 1.0861 1.0856 1.0868 1.0885 1.0921 1.0935 1.0921 1.0956 1.0958 1.0955 1.1014 1.1012 1.0984 1.0759 1.0757
irintensity: 0.1867 0.4897 0.1342 0.1663 0.1722 0.0492 1.4817 1.8574 1.4561 3.1762 6.6009 0.7048 0.0519 0.1216 2.1029 0.4208 0.9736 28.9163 0.6087 2.3812 1.4739 24.4966 17.1760 82.7737 36.5415 16.1039 22.9963 81.0101 17.7497 61.2908 4.2426 10.7595 32.1732 16.7549 42.6230 38.0975 59.2713 17.1549 61.1196 72.0266 61.3381 56.5447 0.8620 1.4770 0.8280 119.5985 132.3039 31.8729 2.7126 2.3382 0.0158 0.3105 1.2091 0.4698 1.8463 1.5902 1.0956 0.2150 0.4605 1.3811 27.8065 7.6374 33.9535 6.9332 14.9824 17.1101 0.8695 0.4998 0.2201 7.0068 6.8646 3.2420 111.7697 34.6850 55.9701 36.0259 132.9827 80.6225 57.3266 0.5253 37.3199 24.4228 21.9854 39.1045 11.7358 5.0532 217.5262 74.9531 1.8444 6.0389 0.4207 2.6249 200.8498 56.7423 11.3160 9.2479 1.4370 0.4580 0.5800 1.4155 20.1780 24.8869 7.1332 28.9778 19.4053 33.6790 20.2351 22.5718 7.5238 38.2159 30.1393
temp: 298.150 k
press: 1.00000 atm
elementType: 16 15 7 7 6 6 6 6 6 6 6 6 6 6 6 6 6 6 6 6 6 6 1 1 1 1 1 1 1 1 1 1 1 1 1 1 1 1 1
symmnumber: 1
zpe: 797870.0 jmol-1
zpe.correction: 0.303893 hartree
zpe.thermalcorrener: 0.323973 hartree
zpe.thermalcorrenthalpy: 0.324917 hartree
zpe.thermalcorrgfe: 0.252320 hartree
zpe.sumelectzpe: -1543.376108 hartree
zpe.sumelectthermal: -1543.356027 hartree
zpe.sumelectthermalent: -1543.355083 hartree
zpe.sumelectthermalfe: -1543.427681 hartree
dipole: 1.7782 0.1245 -3.5726
dipole: 3.9926
quadrupole: -137.3751 -131.1723 -146.2761
quadrupole: -0.6510 9.8984 -1.7399
quadrupole: 0.8994 7.1022 -8.0016 -0.6510 9.8984 -1.7399
hfenergy: -1543.6800003 hartree
pointgroup: C01 [X(C18H17N2P1S1)]
dipole: 0.7718304 0.7671769 -1.1327878 debye
polarizability: 283.4796217|-13.8854416|213.220733|1.6982641|2.1579623|251.5272182 unknown
InChI: InChI=1S/C18H17N2PS/c22-21(18-14-8-3-9-15-18,19-16-10-4-1-5-11-16)20-17-12-6-2-7-13-17/h1-15,19-20H
charge 0 multiplicity 1
39 atoms
S  -0.917009 -1.091763 3.214591
P  -0.163857 -0.586651 1.334072
N  -0.944606 -1.212466 -0.116782
N  1.408699 -1.366377 1.168316
C  -0.026101 1.250714 1.056204
C  -2.293251 -1.015434 -0.518519
C  2.444087 -1.213178 0.209759
C  -0.272456 1.837753 -0.206488
C  0.329289 2.051941 2.167343
C  -0.150771 3.236741 -0.358101
C  0.460311 3.448023 2.005261
C  -2.757484 -1.678386 -1.688195
C  3.734372 -1.723553 0.529481
C  -3.181737 -0.173842 0.203516
C  2.239466 -0.602079 -1.056947
C  0.221911 4.041351 0.742883
C  -4.082051 -1.489395 -2.132874
C  4.788899 -1.630082 -0.400629
C  -4.502697 0.010533 -0.257275
C  3.308108 -0.50456 -1.973986
C  -4.964113 -0.6398 -1.424698
C  4.587159 -1.016716 -1.659658
H  -0.467679 -2.02792 -0.513889
H  1.645238 -1.881438 2.022669
H  -0.576535 1.214943 -1.053674
H  0.476011 1.582193 3.146678
H  -0.349725 3.694891 -1.332768
H  0.739069 4.070798 2.861973
H  -2.078903 -2.335186 -2.247222
H  3.905478 -2.191801 1.506849
H  -2.857427 0.309482 1.130861
H  1.254415 -0.213233 -1.328844
H  0.317699 5.125977 0.620673
H  -4.42444 -2.00827 -3.035447
H  5.773332 -2.032849 -0.136711
H  -5.178198 0.659383 0.311467
H  3.133587 -0.027729 -2.9453
H  -5.992429 -0.494675 -1.771462
H  5.409139 -0.941137 -2.378723
