program: Gaussian 09
title: 000221533
version: EM64L-G09RevD.01
frameworkgroup: C1[X(C17H37NO)]
method: RPBEPBE
basis: SDD
operation: Freq
keyword: #p
keyword: freq=noraman
keyword: PBEPBE/SDD
title: #p freq=noraman PBEPBE/SDD
converged: YES YES NO NO
title: Mulliken charges:
elementType: O N C C C C C C C C C C C C C C C C C H H H H H H H H H H H H H H H H H H H H H H H H H H H H H H H H H H H H H
charge: -0.452717 -0.104035 -0.375767 -0.388712 -0.368885 -0.387873 -0.356147 -0.358142 -0.383046 -0.375617 -0.359479 -0.358003 -0.377782 -0.340012 -0.340426 -0.365145 -0.695425 -0.695463 -0.342636 0.183076 0.201030 0.213188 0.190666 0.189043 0.187823 0.196777 0.194604 0.199409 0.177561 0.198656 0.177658 0.192952 0.192160 0.195171 0.195294 0.185050 0.208084 0.208441 0.184620 0.189168 0.188855 0.190807 0.190687 0.191431 0.190243 0.213744 0.213621 0.209237 0.214264 0.212314 0.209084 0.214280 0.212349 0.186951 0.186996 0.340018
chargesum: 0.00000
title: Mulliken charges with hydrogens summed into heavy atoms:
elementType: O N C C C C C C C C C C C C C C C C C
charge: -0.112699 -0.104035 0.008339 0.015142 0.007981 0.003508 0.020822 0.018172 0.002067 0.014848 0.033655 0.035059 0.000240 0.041481 0.041249 0.062220 -0.059611 -0.059750 0.031312
polarizability: 2.41256467e+02 6.72894785e-01 1.95714792e+02 2.04376197e+00 2.00699723e+00 1.65058651e+02
1716.lowfreq: -4.4512 -0.0008 -0.0006 0.0009 3.4438 7.2178 17.2279 22.9020 27.2782
frequency: 16.8229 22.4352 27.2459 36.8839 40.0378 45.8695 59.6273 63.8760 69.6430 72.6839 94.8995 108.0352 111.6627 116.3066 117.7735 145.9034 150.3611 155.2581 157.0533 174.2211 194.9992 231.0926 234.7694 259.0744 274.7262 276.7770 291.1883 307.5806 338.7315 387.2372 408.7672 450.6799 455.1724 490.2357 513.4545 527.4661 720.3898 729.2468 731.9128 733.3252 748.5201 778.3699 790.9659 794.1545 820.4092 830.6808 880.6772 897.9503 899.3428 926.5836 928.6426 947.8555 958.6164 979.3714 996.3826 1003.4344 1015.5429 1022.4968 1025.9821 1042.0484 1062.3153 1068.9696 1074.2003 1078.6834 1080.2099 1083.9723 1088.3874 1094.6934 1108.7131 1112.4513 1145.6274 1149.8582 1187.1891 1190.0584 1194.5026 1209.7893 1220.8679 1229.8093 1235.3485 1241.8967 1254.2113 1264.3514 1270.0001 1270.8495 1276.9709 1280.7639 1283.5169 1284.2787 1284.6877 1288.8104 1292.9709 1296.3422 1301.1001 1303.0099 1321.8411 1343.3896 1345.1732 1346.1049 1354.1288 1359.0535 1367.8137 1370.3204 1379.5130 1389.6862 1390.4755 1413.6109 1459.6795 1460.8165 1463.4860 1464.1232 1465.5196 1467.2646 1469.5202 1470.4614 1471.6130 1475.4546 1477.4741 1477.5197 1479.1141 1480.8698 1481.5298 1486.4672 1488.5428 1489.4227 1490.5324 2835.0910 2836.3670 2852.1408 2925.1126 2948.2449 2949.5645 2951.7023 2956.2589 2961.3859 2962.5149 2963.6924 2971.9881 2972.2407 2972.3795 2974.5575 2976.7022 2976.9080 2982.6416 2988.5241 2990.8581 2997.8796 3002.9469 3004.3577 3012.7423 3014.3719 3018.1655 3019.1536 3034.6877 3043.7031 3046.3506 3048.1460 3057.9428 3068.8917 3069.6757 3070.9437 3071.1258 3564.0568
redmass: 4.3583 3.8007 1.7770 3.6496 3.3035 3.5319 1.5950 1.6517 1.7385 2.8622 3.0597 2.5048 2.2071 2.5355 2.3221 2.2861 1.9950 2.8437 2.9987 2.8551 2.7201 1.1518 1.1284 3.2372 2.6595 1.0850 2.6574 3.2173 3.3326 3.3189 3.2780 3.0495 2.9826 3.2982 3.0517 3.0478 1.0622 1.0819 1.0761 1.0746 1.1102 1.1482 1.2094 1.1797 1.3812 2.8265 1.2603 1.7273 1.7278 1.2710 1.2264 1.2491 7.3786 3.9997 3.8940 1.9845 1.4805 3.2061 3.2381 3.3336 2.5314 2.3391 2.3982 2.2713 2.1162 2.5488 2.4332 2.7167 2.1465 2.2686 1.6892 1.3854 1.6902 2.0402 1.3445 1.5614 1.3159 1.4075 1.4418 1.3859 1.3253 1.2734 1.2994 1.1627 1.1107 1.0928 1.0823 1.1192 1.2041 1.1554 1.1108 1.1431 1.2611 1.2391 1.3651 1.5076 1.5215 1.4685 1.6895 1.6095 1.3908 1.3896 1.4309 1.2164 1.2362 1.4387 1.0733 1.0732 1.0688 1.0708 1.0740 1.0740 1.0816 1.0748 1.0754 1.0920 1.0423 1.0430 1.0742 1.0666 1.0896 1.0949 1.0875 1.0888 1.0972 1.0712 1.0712 1.0705 1.0544 1.0586 1.0586 1.0588 1.0594 1.0586 1.0585 1.0588 1.0372 1.0374 1.1063 1.0620 1.0605 1.0602 1.0957 1.0978 1.0591 1.1009 1.0970 1.0973 1.0903 1.0908 1.0906 1.0969 1.1043 1.1026 1.1014 1.1022 1.1048 1.1004 1.1005 1.0997 1.0996 1.0664
irintensity: 0.0604 0.1579 4.1260 0.0702 0.0243 0.1473 0.0424 1.1274 2.9753 0.1415 0.4629 1.9157 1.0731 0.9543 1.7548 0.2047 1.3272 0.2089 0.5214 0.4071 1.1662 0.0923 0.0516 1.6230 1.1447 156.5476 0.8276 0.4462 7.4514 2.0687 4.2032 4.3677 0.6906 5.2156 7.2072 8.5844 12.7971 0.3564 8.6903 8.6607 5.5401 0.1467 0.0873 0.0135 3.8557 8.9332 1.2205 15.8933 6.2148 9.3857 1.8456 0.4766 48.5723 17.1558 17.2746 2.0355 1.1354 18.1277 6.2178 5.8350 6.9040 10.1243 8.6201 0.8471 0.8577 19.8482 27.1848 20.5355 1.3191 0.8726 5.8206 1.3660 5.3980 11.9251 15.8627 6.8175 18.1069 1.7001 11.4852 8.0670 11.5943 0.6906 2.2840 1.5801 1.6231 0.5991 1.2621 0.3542 1.8563 0.3832 0.0934 2.3555 19.5897 12.6436 1.0144 0.6924 0.7433 0.7858 0.0063 0.4034 13.8264 11.5970 3.8880 6.8948 9.8062 6.0728 0.1780 0.0310 0.5407 0.4156 0.3140 0.1966 0.3269 0.8020 0.5996 1.8379 12.6121 12.2763 2.4100 4.2194 0.3422 15.3202 14.7565 10.0050 19.3268 39.6906 43.6327 210.9252 61.3243 4.7114 0.1185 14.8151 1.6759 25.7695 26.2021 128.1146 40.7338 23.3217 55.0701 50.7222 41.0016 62.7722 2.9514 0.3268 47.2727 4.7110 10.2789 8.8468 7.4999 9.3788 9.6370 7.8025 33.7715 51.0537 61.6454 133.5052 133.1607 82.9464 102.1661 42.9397 74.4012 2.0906
temp: 298.150 k
press: 1.00000 atm
elementType: 8 7 6 6 6 6 6 6 6 6 6 6 6 6 6 6 6 6 6 1 1 1 1 1 1 1 1 1 1 1 1 1 1 1 1 1 1 1 1 1 1 1 1 1 1 1 1 1 1 1 1 1 1 1 1 1
symmnumber: 1
zpe: 1345412.5 jmol-1
zpe.correction: 0.512441 hartree
zpe.thermalcorrener: 0.538742 hartree
zpe.thermalcorrenthalpy: 0.539686 hartree
zpe.thermalcorrgfe: 0.451002 hartree
zpe.sumelectzpe: -798.333443 hartree
zpe.sumelectthermal: -798.307142 hartree
zpe.sumelectthermalent: -798.306198 hartree
zpe.sumelectthermalfe: -798.394882 hartree
dipole: 0.0021 -0.9928 -2.2508
dipole: 2.4600
quadrupole: -117.0010 -123.0341 -126.8181
quadrupole: 9.7340 12.6393 -1.4280
quadrupole: 5.2834 -0.7497 -4.5337 9.7340 12.6393 -1.4280
hfenergy: -798.8458837 hartree
pointgroup: C01 [X(C17H37N1O1)]
dipole: 0.0031581 -0.4060999 -0.8785334 debye
polarizability: 241.2455458|1.1598401|195.7943103|1.8704504|1.4841951|164.9900541 unknown
InChI: InChI=1S/C17H37NO/c1-3-5-14-18(15-6-4-2)16-12-10-8-7-9-11-13-17-19/h19H,3-17H2,1-2H3
charge 0 multiplicity 1
56 atoms
O  -9.569355 0.221514 0.808225
N  3.052667 0.02668 -0.34296
C  1.757347 -0.432507 -0.910202
C  0.535426 0.098065 -0.130305
C  -0.808689 -0.363238 -0.737599
C  -2.035581 0.135222 0.058797
C  3.396919 1.416724 -0.742645
C  4.162577 -0.934428 -0.575896
C  -3.383665 -0.3339 -0.533174
C  -4.607234 0.154294 0.274244
C  4.277955 2.146375 0.293812
C  4.127524 -2.141838 0.385282
C  -5.956428 -0.321307 -0.310479
C  4.660328 3.576851 -0.150693
C  5.273801 -3.146236 0.125629
C  -7.170795 0.166688 0.5115
C  5.530902 4.313146 0.890494
C  5.232318 -4.357874 1.082006
C  -8.506247 -0.307179 -0.066615
H  1.66012 -0.151431 -1.991237
H  1.737817 -1.538282 -0.875025
H  0.618795 -0.246198 0.918894
H  0.560395 1.206255 -0.097601
H  -0.884167 -0.008197 -1.787216
H  -0.830592 -1.472748 -0.783503
H  -1.954983 -0.215049 1.109062
H  -2.019469 1.244502 0.10047
H  2.454188 1.984741 -0.85765
H  3.902073 1.442757 -1.743586
H  5.118681 -0.398076 -0.425496
H  4.172717 -1.30244 -1.635165
H  -3.468724 0.023078 -1.58116
H  -3.395277 -1.443156 -0.581228
H  -4.518572 -0.199483 1.322625
H  -4.599095 1.2633 0.319457
H  5.203793 1.56517 0.481035
H  3.73133 2.179655 1.256313
H  4.180319 -1.762043 1.424139
H  3.156531 -2.669869 0.295031
H  -6.04616 0.037316 -1.357664
H  -5.960261 -1.430719 -0.359036
H  3.736336 4.161535 -0.339482
H  5.200705 3.529922 -1.118711
H  6.248236 -2.62601 0.229345
H  5.22169 -3.501295 -0.924409
H  -7.091197 -0.194749 1.555229
H  -7.179063 1.273192 0.554851
H  6.477059 3.768751 1.071687
H  5.787714 5.335148 0.555762
H  5.003063 4.396378 1.859151
H  4.283407 -4.916131 0.971657
H  6.062942 -5.060341 0.884454
H  5.307226 -4.031849 2.136481
H  -8.627198 0.071363 -1.105877
H  -8.535955 -1.41901 -0.094944
H  -10.45249 -0.065333 0.463825
