program: Gaussian 09
title: 000221526
version: EM64L-G09RevD.01
frameworkgroup: C1[X(C13H18O)]
method: RPBEPBE
basis: SDD
operation: Freq
keyword: #pfreq=noraman
keyword: PBEPBE/SDD
title: #p freq=noraman PBEPBE/SDD
converged: NO YES NO NO
title: Mulliken charges:
elementType: O C C C C C C C C C C C C C H H H H H H H H H H H H H H H H H H
charge: -0.267674 -0.209145 -0.441858 -0.441854 -0.396585 -0.396580 -0.382530 0.559617 -0.462047 -0.405012 -0.351224 -0.378867 0.310027 -0.537714 0.198624 0.215471 0.193258 0.193265 0.215470 0.191372 0.198698 0.198699 0.191372 0.186637 0.198599 0.233054 0.224649 0.246158 0.234967 0.243373 0.218890 0.218887
chargesum: 0.00000
title: Mulliken charges with hydrogens summed into heavy atoms:
elementType: O C C C C C C C C C C C C C
charge: -0.267674 -0.010521 -0.033129 -0.033119 -0.006515 -0.006509 0.002706 0.559617 -0.228994 -0.180363 -0.105066 -0.143899 0.310027 0.143436
polarizability: 2.00090785e+02 3.30682523e+00 1.28061905e+02 -2.01182572e-03 -9.19682129e-03 9.74814512e+01
1716.lowfreq: -13.1444 -10.6911 -0.0007 -0.0005 0.0006 7.0723 27.4177 55.9665 81.4587
frequency: 26.6504 55.9386 81.3773 110.5165 182.1520 185.9584 225.8156 240.8778 247.4253 265.5839 346.9994 393.5200 412.3133 419.6452 429.8652 478.5240 487.2242 538.5042 553.6491 632.2913 733.3728 734.9161 779.7718 782.0654 809.0387 826.8564 830.6072 859.5823 889.4093 890.8204 915.1730 937.4967 959.9436 986.1640 991.4740 1004.3263 1048.2698 1051.7940 1070.4589 1100.9938 1110.9921 1113.2458 1136.9011 1156.0325 1177.1744 1180.7374 1207.7624 1228.4096 1232.5719 1257.3058 1262.5368 1288.3258 1304.7105 1309.1345 1328.2428 1334.6458 1339.0871 1344.0971 1352.1776 1386.7975 1418.6678 1437.0155 1458.9469 1459.4944 1462.0541 1466.0286 1467.5413 1472.9953 1475.3728 1500.5740 1582.9816 1623.2633 2952.6521 2954.9898 2962.9950 2963.2501 2964.4487 2964.7468 2971.4685 3021.9464 3024.3742 3030.0619 3031.7508 3040.7780 3042.2204 3117.6100 3120.2102 3122.1796 3155.3483 3162.5189
redmass: 3.5356 3.2585 3.2730 3.5923 2.8570 2.3819 1.7306 4.8853 1.3758 2.8009 1.7999 4.7996 2.9161 3.5647 3.1338 1.6661 3.1840 2.3642 3.6576 6.8071 3.2562 3.6201 3.1053 1.4590 1.3691 3.5218 1.5200 1.7344 1.4915 2.3338 1.7503 1.4861 1.3683 3.4864 4.6884 2.4118 1.8068 1.3541 1.2449 1.5012 2.4491 1.2597 1.9191 1.3481 1.2573 1.4705 1.8724 3.2044 1.5323 1.2820 1.3049 1.4522 1.2582 1.3441 1.3242 1.3654 1.4977 1.5557 1.5983 3.6107 2.9502 1.1730 1.0878 1.0905 1.0900 1.0500 1.0825 1.0764 1.0962 2.4562 6.9516 6.4529 1.0795 1.0334 1.0623 1.0591 1.0665 1.0616 1.0651 1.0970 1.0951 1.1001 1.1028 1.1038 1.1032 1.0894 1.0908 1.0962 1.0939 1.0951
irintensity: 0.0737 1.7279 0.1556 4.5592 2.1916 1.5510 0.0715 0.2337 0.5537 1.6961 0.4343 1.0573 0.0512 0.5285 0.1741 1.2798 1.8444 23.9713 13.7964 0.7878 5.3989 0.5906 4.0426 1.1412 24.6094 5.4112 52.9621 4.6794 4.7359 0.1246 1.3606 0.2056 0.1572 35.4876 18.0698 7.2196 0.6982 0.0740 0.0185 11.3085 0.0000 0.2280 9.3716 0.3180 58.4067 0.6937 17.8164 157.2377 4.0592 1.6398 1.6316 3.5565 0.1307 0.2958 0.0068 0.1845 0.4180 3.6388 2.1907 8.7669 0.2710 10.0473 1.2502 4.1789 10.3149 12.7092 20.1938 60.3105 2.7388 126.0181 6.8922 37.0087 7.7265 69.3607 33.1048 47.6948 39.4056 17.4830 41.8809 94.5481 80.4966 3.4767 5.7643 53.2187 130.8375 15.1272 48.6591 3.4878 17.4383 6.4004
temp: 298.150 k
press: 1.00000 atm
elementType: 8 6 6 6 6 6 6 6 6 6 6 6 6 6 1 1 1 1 1 1 1 1 1 1 1 1 1 1 1 1 1 1
symmnumber: 1
zpe: 729702.5 jmol-1
zpe.correction: 0.277929 hartree
zpe.thermalcorrener: 0.291132 hartree
zpe.thermalcorrenthalpy: 0.292076 hartree
zpe.thermalcorrgfe: 0.237621 hartree
zpe.sumelectzpe: -580.333033 hartree
zpe.sumelectthermal: -580.319830 hartree
zpe.sumelectthermalent: -580.318885 hartree
zpe.sumelectthermalfe: -580.373341 hartree
dipole: 0.1600 -1.6031 0.0008
dipole: 1.6111
quadrupole: -77.9613 -79.1263 -88.6902
quadrupole: 8.6621 -0.0045 -0.0035
quadrupole: 3.9647 2.7996 -6.7643 8.6621 -0.0045 -0.0035
hfenergy: -580.6109618 hartree
pointgroup: C01 [X(C13H18O1)]
dipole: 0.0739867 -0.6295191 -0.0008328 debye
polarizability: 199.952985|4.5652708|128.1996362|0.0033916|0.0469698|97.4815204 unknown
InChI: InChI=1S/C13H18O/c1-14-13-9-7-12(8-10-13)11-5-3-2-4-6-11/h7-11H,2-6H2,1H3
charge 0 multiplicity 1
32 atoms
O  -4.238394 0.131716 0.000322
C  1.539387 0.463443 0.000581
C  2.180534 -0.157386 -1.275424
C  2.180577 -0.160686 1.274963
C  3.720173 -0.007313 -1.275296
C  3.720214 -0.010603 1.275182
C  4.346893 -0.621123 -0.000851
C  0.01722 0.340604 0.00045
C  -0.811053 1.495214 0.002202
C  -0.622683 -0.923326 -0.001411
C  -2.215167 1.397736 0.002112
C  -2.03071 -1.046195 -0.00153
C  -2.831764 0.122623 0.000247
C  -4.919893 -1.163277 -0.001395
H  1.794297 1.545322 0.001973
H  1.744691 0.315981 -2.176515
H  1.918319 -1.234742 -1.324183
H  1.918362 -1.238167 1.320915
H  1.744746 0.31033 2.17729
H  3.982158 1.070386 -1.32629
H  4.146538 -0.482284 -2.180531
H  4.146602 -0.48791 2.179177
H  3.982195 1.066963 1.328961
H  4.174404 -1.717866 -0.002263
H  5.443891 -0.468629 -0.000674
H  -0.345143 2.488525 0.003668
H  -0.01816 -1.838669 -0.002813
H  -2.852186 2.287856 0.003461
H  -2.484046 -2.042387 -0.003013
H  -5.993437 -0.923077 -0.000912
H  -4.669653 -1.753393 0.902377
H  -4.669912 -1.750871 -0.906881
