program: Gaussian 09
title: 000221524
version: EM64L-G09RevD.01
frameworkgroup: C1[X(C14H29N)]
method: RPBEPBE
basis: SDD
operation: Freq
keyword: #pfreq=noraman
keyword: PBEPBE/SDD
title: #p freq=noraman PBEPBE/SDD
converged: YES YES NO NO
title: Mulliken charges:
elementType: N C C C C C C C C C C C C C C H H H H H H H H H H H H H H H H H H H H H H H H H H H H H
charge: -0.315138 -0.042725 -0.444875 -0.411549 -0.390955 -0.393043 0.018357 -0.384185 -0.460762 -0.444689 -0.389093 -0.373198 -0.723945 -0.353549 -0.698250 0.196188 0.219875 0.176250 0.176403 0.210756 0.191347 0.196547 0.195737 0.189300 0.172667 0.186521 0.197438 0.196855 0.207379 0.236377 0.197806 0.194953 0.186146 0.227763 0.200387 0.190632 0.217185 0.206142 0.214200 0.195152 0.193182 0.208338 0.215770 0.210304
chargesum: 0.00000
title: Mulliken charges with hydrogens summed into heavy atoms:
elementType: N C C C C C C C C C C C C C C
charge: -0.078761 0.153463 -0.048750 -0.024390 -0.003060 -0.008006 0.191025 -0.000227 -0.056528 -0.051930 0.024816 0.017821 -0.086419 0.034785 -0.063838
polarizability: 1.74290421e+02 -1.17712267e+00 1.60000825e+02 4.02155846e-01 1.46755485e+00 1.36543493e+02
1716.lowfreq: -22.2230 -7.0073 -0.0006 -0.0005 0.0002 5.5330 13.5972 17.4642 41.4281
frequency: -17.2806 16.4938 41.3520 56.2097 61.3936 86.6678 107.7085 116.1159 143.7418 175.3619 196.0839 212.9695 225.9654 235.8749 257.7903 288.3903 309.3580 322.1079 347.9514 410.9865 435.7575 438.3789 448.6309 481.3286 512.5078 596.7867 653.1457 728.9574 765.0054 774.6642 776.3827 795.6619 823.0924 841.3460 872.9843 889.1112 891.9986 909.4264 915.7259 921.6010 946.5142 978.5714 1004.1056 1031.8074 1033.7874 1041.5919 1049.2394 1051.8583 1070.9150 1080.4723 1089.6895 1104.1808 1111.7638 1118.0005 1145.6595 1164.8629 1165.8143 1187.0991 1206.4651 1221.2826 1239.6348 1247.6616 1252.9387 1254.8294 1267.4563 1270.4218 1284.9872 1288.4831 1300.8745 1305.9381 1325.7926 1328.4464 1332.7764 1336.5453 1337.6172 1342.3094 1348.7139 1352.3269 1357.0472 1375.7652 1385.9098 1388.0691 1443.9187 1455.6423 1458.9711 1460.4895 1461.9356 1464.7217 1466.5556 1472.2908 1473.2223 1473.7701 1476.5952 1482.8284 1483.7385 1489.2445 1496.7863 2877.2957 2941.1982 2944.6908 2947.7768 2951.0458 2956.1751 2961.5419 2962.0259 2963.6300 2965.2779 2966.4530 2970.2566 2971.4224 2973.0309 2987.9114 3006.5629 3011.7774 3022.0927 3024.0764 3027.6949 3028.5162 3032.3453 3035.3748 3044.1541 3064.8637 3067.4437 3070.5050 3071.0602 3419.7280
redmass: 2.7741 3.5901 2.2712 1.6827 2.5999 2.9538 3.0434 2.4126 1.7880 2.4419 2.3330 1.7987 1.2086 1.3004 2.6383 3.0169 1.9479 2.3333 2.7599 3.0696 2.8016 1.9330 2.6267 2.2836 2.1790 1.8858 1.5387 1.0823 1.2856 1.7622 1.5077 1.9121 1.5428 2.0116 1.8050 1.5397 1.7774 2.0163 1.9584 1.2896 1.8597 1.7818 2.3934 1.7347 1.6973 1.7829 1.1961 2.2914 1.3950 2.4616 2.0825 2.1381 2.3833 2.0132 2.4915 2.3030 2.8458 1.5491 1.4906 1.2692 1.2599 1.2647 1.3016 1.3047 1.2652 1.1957 1.2123 1.1087 1.3063 1.2295 1.3761 1.3772 1.4236 1.4660 1.4923 1.4690 1.6106 1.5097 1.4301 1.3531 1.2247 1.2165 1.1963 1.0886 1.0894 1.0889 1.0786 1.0706 1.0799 1.0719 1.0606 1.0889 1.0428 1.0661 1.0625 1.0911 1.0699 1.0713 1.0822 1.0739 1.0655 1.0590 1.0597 1.0703 1.0636 1.0625 1.0643 1.0589 1.0397 1.0365 1.0583 1.0976 1.1008 1.0868 1.0963 1.0969 1.0990 1.1011 1.1008 1.1001 1.0991 1.0990 1.1006 1.0993 1.0995 1.0732
irintensity: 0.0995 0.0657 0.0174 0.0561 0.2392 0.0760 0.0331 0.1734 0.7732 0.8485 1.6499 0.1657 0.0738 0.2960 0.6296 0.4092 2.8610 0.5709 0.3811 2.7580 0.5960 2.2892 0.0664 0.1568 5.5127 17.3374 63.3228 5.6621 11.8669 2.6583 0.1772 2.7841 0.0442 4.7497 1.3598 18.3050 8.3514 2.6060 0.6622 9.1399 5.1212 1.6989 5.2061 5.3794 0.6360 1.4623 0.9889 1.7995 1.3055 0.4801 12.8631 52.7767 0.6486 2.7630 12.4813 0.5274 20.9132 0.7828 0.2197 4.4008 2.6075 5.0848 3.2701 3.3587 1.0701 1.3650 0.6704 0.4075 0.4472 0.8146 2.7032 0.9942 0.6963 0.3353 6.0607 1.3152 0.5153 2.0113 15.5362 3.9484 12.8216 12.1718 32.9231 2.6673 2.8878 8.8173 10.2052 1.3291 25.5142 1.9899 2.1678 7.2881 12.5283 9.3749 10.2753 17.0530 18.1636 71.5480 32.3477 7.9347 15.7733 0.9815 15.3012 7.5270 56.3613 36.4360 72.7177 63.1715 74.4504 38.2710 48.6122 1.8705 9.1594 39.0013 86.0059 86.1458 7.6067 16.5700 70.2120 61.3657 92.4944 54.5392 88.2094 52.4124 80.8472 2.3863
temp: 298.150 k
press: 1.00000 atm
elementType: 7 6 6 6 6 6 6 6 6 6 6 6 6 6 6 1 1 1 1 1 1 1 1 1 1 1 1 1 1 1 1 1 1 1 1 1 1 1 1 1 1 1 1 1
symmnumber: 1
zpe: 1065513.1 jmol-1
zpe.correction: 0.405833 hartree
zpe.thermalcorrener: 0.423335 hartree
zpe.thermalcorrenthalpy: 0.424279 hartree
zpe.thermalcorrgfe: 0.359206 hartree
zpe.sumelectzpe: -604.375048 hartree
zpe.sumelectthermal: -604.357545 hartree
zpe.sumelectthermalent: -604.356601 hartree
zpe.sumelectthermalfe: -604.421674 hartree
dipole: 0.1313 -0.8421 -0.4193
dipole: 0.9499
quadrupole: -95.4847 -99.4171 -98.0118
quadrupole: -0.1812 -0.0979 -1.9548
quadrupole: 2.1532 -1.7792 -0.3739 -0.1812 -0.0979 -1.9548
hfenergy: -604.7808801 hartree
pointgroup: C01 [X(C14H29N1)]
dipole: -0.0219386 -0.3623849 0.0886096 debye
polarizability: 173.8541399|2.2841784|159.6300167|-3.1249804|3.6599065|137.3505823 unknown
InChI: InChI=1S/C14H29N/c1-3-5-9-13(4-2)12-15-14-10-7-6-8-11-14/h13-15H,3-12H2,1-2H3
charge 0 multiplicity 1
44 atoms
N  -0.40902 0.510585 -0.099125
C  -1.794028 0.141807 0.285539
C  -2.709476 0.221704 -0.958411
C  -1.930045 -1.255248 0.962964
C  -4.181172 -0.116613 -0.619342
C  -3.401697 -1.587265 1.312332
C  1.866766 1.388823 0.52747
C  -4.305246 -1.501785 0.059728
C  0.567118 0.678605 1.000491
C  2.596259 0.601885 -0.597876
C  1.59957 2.849299 0.073534
C  2.952847 -0.863861 -0.258394
C  1.179914 3.804143 1.21255
C  3.781958 -1.552276 -1.367248
C  4.129929 -3.020308 -1.039294
H  -2.138769 0.907394 1.014377
H  -2.627174 1.233033 -1.398313
H  -2.337126 -0.494993 -1.723034
H  -1.536841 -2.023046 0.261484
H  -1.301684 -1.297224 1.874023
H  -4.584479 0.659653 0.063987
H  -4.797985 -0.0821 -1.538464
H  -3.468291 -2.594376 1.768567
H  -3.767648 -0.867796 2.0747
H  2.545084 1.416735 1.41012
H  -4.002726 -2.289987 -0.661018
H  -5.35999 -1.702537 0.33152
H  0.84516 -0.282623 1.49665
H  0.082106 1.295947 1.781463
H  -0.053529 -0.122878 -0.830046
H  1.983484 0.631637 -1.523639
H  3.533228 1.143691 -0.843547
H  2.518922 3.243682 -0.406133
H  0.810166 2.827616 -0.702609
H  2.03002 -1.455126 -0.083783
H  3.522681 -0.893541 0.694046
H  0.20981 3.510694 1.65388
H  1.932616 3.814118 2.024565
H  1.071112 4.840099 0.84124
H  4.716196 -0.977315 -1.532305
H  3.219666 -1.508223 -2.322759
H  3.213199 -3.625373 -0.90455
H  4.726262 -3.486229 -1.845411
H  4.715549 -3.088623 -0.102933
