program: Gaussian 09
title: 000221504
version: EM64L-G09RevD.01
frameworkgroup: C1[X(C10H11ClN2S2)]
method: RPBEPBE
basis: SDD
operation: Freq
keyword: #p
keyword: freq=noraman
keyword: PBEPBE/SDD
title: #p freq=noraman PBEPBE/SDD
converged: YES YES NO NO
title: Mulliken charges:
elementType: Cl S S N N C C C C C C C C C C H H H H H H H H H H H
charge: -0.080777 0.222907 0.222030 -0.325371 -0.018768 -0.681112 -0.390604 -0.663150 0.573919 -0.437268 -0.309532 -0.324440 -0.220630 -0.236086 -0.251453 0.265247 0.281997 0.239541 0.233411 0.315356 0.280500 0.310730 0.281997 0.252465 0.225821 0.233273
chargesum: 0.00000
title: Mulliken charges with hydrogens summed into heavy atoms:
elementType: Cl S S N N C C C C C C C C C C
charge: -0.080777 0.222907 0.222030 -0.014641 -0.018768 -0.133868 0.082347 -0.067294 0.573919 -0.437268 -0.309532 -0.042443 0.031835 -0.010265 -0.018181
polarizability: 2.31719444e+02 1.24373206e+01 1.76338121e+02 1.34786078e+00 3.05354259e+00 1.06078114e+02
1716.lowfreq: -6.5997 0.0016 0.0017 0.0030 2.9020 4.9005 22.0206 28.4121 46.1873
frequency: 21.9367 28.3502 46.1737 69.5027 109.2072 110.6349 142.5434 180.3292 207.0706 236.2227 259.3888 306.7907 338.9082 382.9742 408.3292 440.5594 481.2464 510.6695 517.0661 536.2240 547.4922 575.3338 588.5420 617.9540 661.8933 672.1263 715.5973 753.2722 785.4241 829.0016 861.7679 872.7348 935.2108 936.7781 942.3169 980.0503 986.2606 1003.0747 1004.2981 1042.4229 1121.5571 1135.7222 1155.4456 1176.4023 1188.2981 1228.7062 1243.0988 1261.0549 1282.0929 1303.3099 1335.5107 1379.1834 1435.9639 1447.3464 1459.1139 1463.4495 1473.7393 1520.6478 1562.2786 1579.7392 1619.6920 2982.7817 3043.5380 3048.6802 3060.9364 3121.1497 3129.1704 3142.2405 3147.9199 3157.9159 3176.5555 3519.3565
redmass: 8.3088 7.0201 6.1709 7.3104 2.3540 7.5833 5.1654 7.5770 3.3867 4.2559 8.8000 3.4819 6.8117 8.0635 8.8503 3.4896 5.3346 9.0696 4.3409 3.3948 4.3334 6.3585 4.4995 1.5703 5.8215 3.1035 4.2107 1.2362 4.1691 1.6908 1.3513 8.0715 2.5408 1.3836 1.7584 1.3129 2.7289 2.7666 4.0146 2.0835 2.0687 1.2473 1.9073 1.1126 1.1375 1.2245 1.2301 1.1861 1.4558 1.2547 1.7942 5.4239 2.5474 1.0982 1.1210 1.7459 1.2257 2.0638 6.8981 4.5424 6.0715 1.0649 1.0636 1.0610 1.0923 1.0903 1.1095 1.0903 1.1091 1.0930 1.0997 1.0764
irintensity: 0.3006 0.1482 0.1909 1.5890 0.9326 1.2293 1.6941 4.3406 9.3566 6.6854 19.7642 8.5673 17.4978 7.2349 11.3675 13.3592 112.0709 1.9468 14.4814 22.9018 5.5938 21.1322 7.8498 123.9429 34.7560 1.6804 2.0571 102.6039 1.4533 2.3088 5.1550 244.2329 34.2368 7.5531 3.5023 1.3507 15.0430 23.8761 29.2929 6.1470 59.2193 4.2481 77.3992 3.3964 11.1167 160.8843 6.4467 8.0990 19.9298 11.7444 52.8963 59.5162 26.9761 6.4017 2.4746 15.2817 31.1770 188.2572 131.6875 6.5030 133.1267 41.4825 18.7708 18.8214 35.4561 14.1758 13.1162 1.4043 5.5349 10.6648 15.1095 66.1551
temp: 298.150 k
press: 1.00000 atm
elementType: 17 16 16 7 7 6 6 6 6 6 6 6 6 6 6 1 1 1 1 1 1 1 1 1 1 1
symmnumber: 1
zpe: 505711.0 jmol-1
zpe.correction: 0.192615 hartree
zpe.thermalcorrener: 0.207582 hartree
zpe.thermalcorrenthalpy: 0.208526 hartree
zpe.thermalcorrgfe: 0.147683 hartree
zpe.sumelectzpe: -1752.235603 hartree
zpe.sumelectthermal: -1752.220637 hartree
zpe.sumelectthermalent: -1752.219692 hartree
zpe.sumelectthermalfe: -1752.280536 hartree
dipole: 1.3269 1.9728 1.8189
dipole: 2.9935
quadrupole: -103.4527 -99.7875 -114.5146
quadrupole: 7.5658 6.5266 -4.3053
quadrupole: 2.4655 6.1308 -8.5963 7.5658 6.5266 -4.3053
hfenergy: -1752.4282186 hartree
pointgroup: C01 [X(C10H11Cl1N2S2)]
dipole: -0.4340911 -1.0798902 0.1801271 debye
dipolederiv: -0.3422886 -0.2286245 -0.1011557 -0.3016871 -0.4854717 -0.2330592 -0.1263807 -0.2285163 -0.2054144 -0.5052916 0.014405 -0.2812182 -0.1570246 -0.1521923 -0.0285177 -0.3849328 0.0364619 -0.2901611 -1.0225556 -0.0758619 -0.1729364 -0.0473947 -0.2673763 -0.0715511 -0.7660168 -0.0618168 -0.2814037 -1.6536852 0.3966671 0.0256596 0.4046741 -0.3443713 -0.1054109 0.7433227 -0.35048 -0.7391868 -0.7373584 -0.0093308 -0.2321665 -0.1824846 -0.9395284 0.113945 -0.2157603 0.2838717 -0.5288274 0.0276436 0.1105565 -0.1121785 0.2235849 0.1178073 0.0900949 -0.247223 0.0023363 0.0430592 0.3185822 0.0309855 0.0117142 0.0575041 0.3104973 -0.0035729 0.0227585 0.0556821 0.2565831 2.1295391 -0.3933354 0.156859 -0.4089851 0.01881 -0.1652885 0.5203269 -0.0443233 0.4093408 0.4402938 -0.3617468 -0.2744006 -0.9586771 0.2610905 0.2419426 -0.8560145 0.2708009 0.4268624 0.9183115 0.1983249 0.6375257 0.6210968 0.8321076 0.0234221 0.8037313 -0.1193024 0.5297135 0.1205612 0.5691585 0.3022784 0.5279707 0.5582077 0.3783216 0.3011797 0.2942229 0.0611331 -0.0360532 -0.098169 -0.0797771 0.3644096 -0.1547181 -0.0556647 0.2161983 0.034953 -0.1817624 -0.0048531 -0.084154 -0.0925397 -0.0387741 -0.0734365 -0.0055666 -0.0514564 0.0379883 -0.0517287 0.1195688 0.1119818 -0.0244987 -0.0468079 0.0310607 0.1121512 -0.1203871 0.0949969 -0.0411742 -0.1606563 -0.0130822 -0.0419801 0.0221288 -0.1302878 0.0791369 0.0033387 0.0580765 -0.1270085 0.0477751 -0.0430949 -0.0376382 -0.1001237 0.0214467 -0.0896288 -0.0556134 -0.0749505 -0.0256281 -0.0891417 -0.0209495 0.067227 -0.05497 0.0199591 0.0004 0.1466215 0.0330187 0.0220957 0.0311043 -0.0653857 0.0148756 -0.0748538 -0.0457281 0.0708172 0.0535331 0.1155218 -0.0003487 -0.0285617 0.0534478 0.0651763 0.0283075 -0.0382241 -0.0539858 0.0260571 -0.1600645 -0.0116419 0.0598925 0.044788 0.0332165 0.0750713 0.0047685 0.0933077 -0.1066673 0.036883 0.0993979 -0.0213753 0.0091495 -0.0304032 0.1165393 0.062528 -0.0722512 -0.0637595 -0.0562264 -0.0620352 0.224554 0.0070845 0.049985 0.0527324 0.1751994 -0.0535562 0.0631537 0.0049256 0.3070905 0.1317159 -0.0564614 0.037885 -0.0525573 0.0841607 -0.0418167 -0.0068182 -0.0341201 0.1009318 -0.0457709 -0.0355537 0.0397314 -0.0503087 0.1163743 -0.0164913 0.0346707 -0.0210234 0.1372214 0.0529697 -0.1009919 -0.0330251 -0.0646223 -0.0146076 -0.092465 -0.0159873 -0.0920717 0.091621 0.02508 0.0401928 0.0717843 0.0452515 0.0319245 -0.1147127 0.0821253 -0.1168443 0.0612709 unknown
polarizability: 226.0999721|14.817733|164.925966|15.6995155|31.3320571|123.1097405 unknown
InChI: InChI=1S/C10H11ClN2S2/c11-8-3-1-2-4-9(8)13-7-15-10-12-5-6-14-10/h1-4,13H,5-7H2
charge 0 multiplicity 1
26 atoms
Cl 3.849576 1.915511 0.970674
S  -3.884441 0.657176 -1.366987
S  -1.652945 1.851436 0.448252
N  0.966857 1.104236 1.44071
N  -2.451368 -0.804725 0.433185
C  -4.508785 -1.095784 -0.967531
C  -3.326967 -1.803885 -0.233657
C  -0.403951 1.028184 1.783886
C  1.62469 0.250792 0.539131
C  -2.591843 0.396281 -0.042939
C  2.992996 0.470858 0.216397
C  0.985505 -0.865352 -0.072186
C  3.714994 -0.361113 -0.650711
C  1.702937 -1.711578 -0.942098
C  3.064492 -1.471991 -1.237764
H  -4.775084 -1.595009 -1.911046
H  -5.397407 -0.994655 -0.325236
H  -3.709923 -2.514069 0.519818
H  -2.708646 -2.375305 -0.954812
H  -0.7973 0.002871 1.857956
H  -0.617726 1.608765 2.690907
H  1.48953 1.939226 1.716164
H  -0.073764 -1.059366 0.130239
H  4.766231 -0.145513 -0.862946
H  1.188089 -2.564097 -1.398483
H  3.616652 -2.129999 -1.915619
