program: Gaussian 09
title: 000221491
version: EM64L-G09RevD.01
frameworkgroup: C1[X(C17H16N4O4)]
method: RPBEPBE
basis: SDD
operation: Freq
keyword: #p
keyword: freq=noraman
keyword: PBEPBE/SDD
title: #p freq=noraman PBEPBE/SDD
converged: YES YES NO NO
title: Mulliken charges:
elementType: O O O O N N N N C C C C C C C C C C C C C C C C C H H H H H H H H H H H H H H H H
charge: -0.247956 -0.195704 -0.194253 -0.228842 -0.455325 -0.040323 -0.080222 0.022106 -0.375114 0.145708 0.207310 0.490446 0.268404 -0.544383 0.198336 0.452531 -0.294549 -0.336777 -0.796766 -0.444668 -0.348364 -0.766105 -0.206878 -0.216805 -0.248956 0.277800 0.289993 0.377380 0.289396 0.248148 0.235703 0.240598 0.240824 0.275388 0.301614 0.230171 0.297241 0.247845 0.229331 0.226708 0.229009
chargesum: 0.00000
title: Mulliken charges with hydrogens summed into heavy atoms:
elementType: O O O O N N N N C C C C C C C C C C C C C C C C C
charge: -0.247956 -0.195704 -0.194253 -0.228842 -0.077945 -0.040323 -0.080222 0.022106 -0.097315 0.145708 0.207310 0.490446 0.268404 -0.254391 0.198336 0.452531 -0.005153 -0.088629 -0.079640 -0.169280 -0.046750 0.009152 0.022453 0.009903 -0.019946
polarizability: 3.68632772e+02 4.51065560e+00 2.89948966e+02 4.08427673e+00 -2.13453236e+01 1.33296498e+02
1716.lowfreq: -5.1806 0.0008 0.0009 0.0009 1.9943 4.7774 20.0741 22.6789 35.3371
frequency: 20.0315 22.4756 35.3122 42.5320 46.8653 55.7691 64.3467 70.8016 82.8691 94.6557 106.1470 135.2210 147.0813 159.4144 184.0112 206.8916 225.4734 238.7073 272.6752 283.4819 320.2390 333.0884 349.0675 366.0024 380.6323 399.6932 409.2581 416.8549 449.9017 464.0588 505.3404 512.8639 551.1811 552.9407 588.1070 609.5055 615.6285 656.3854 667.9368 674.5284 699.7203 722.6254 737.0453 758.5395 761.7916 773.3102 789.2332 827.0819 845.1190 856.9751 876.1903 905.6330 911.5933 928.7793 931.4372 942.2549 980.7185 983.6956 985.7966 998.7148 1002.8028 1017.4122 1027.9584 1032.5356 1049.8259 1067.9336 1092.4851 1147.6368 1164.6266 1174.7276 1183.3463 1189.6372 1197.6125 1207.1952 1218.5567 1224.2546 1261.2199 1269.3548 1284.6380 1327.4227 1343.5008 1371.2441 1372.6873 1384.9466 1403.2478 1418.1117 1428.5817 1433.5634 1437.3530 1445.3952 1468.3091 1471.7701 1480.0383 1487.8040 1536.2382 1564.2165 1604.0133 1613.5820 1614.4099 1619.0594 1633.1736 2931.3933 2983.4552 2984.6201 3062.9284 3067.3681 3098.2428 3126.6418 3129.2295 3137.0793 3137.9702 3149.8593 3164.1013 3166.0493 3170.7557 3198.3331 3420.6724
redmass: 3.7087 1.1529 5.2576 7.6646 4.5773 5.0529 6.4880 8.1961 6.5718 5.9958 4.9136 3.0976 1.7616 3.1637 5.1190 4.2020 5.8115 5.1174 5.1456 4.7616 5.2379 7.6432 6.8311 5.0946 5.7035 4.7712 2.9863 5.2263 5.6660 4.9884 3.8353 3.0820 6.9056 3.4303 4.9934 4.9972 5.7837 7.4668 5.6455 5.5967 1.9693 6.0335 6.8871 1.4434 4.4540 5.4716 1.4126 3.7023 1.5608 1.2442 3.2165 4.4534 1.3925 2.8650 1.4447 4.3410 1.3610 1.3819 5.6969 1.3074 1.4598 3.0433 2.2659 2.0829 1.5616 3.0330 1.5876 1.4332 2.7667 1.1065 2.3272 3.4197 1.1360 4.1399 1.7439 2.2386 2.4462 1.6401 1.7657 1.4100 7.5757 1.4267 3.0694 6.4195 1.2361 5.5305 6.5749 2.3010 1.1365 1.0814 1.0466 1.2389 2.3463 2.3293 1.9556 6.4063 5.5776 6.6840 5.5726 5.8314 4.9552 1.0794 1.0369 1.0379 1.0975 1.0950 1.0989 1.1010 1.0851 1.0895 1.0894 1.0948 1.0959 1.1003 1.0928 1.0948 1.0792
irintensity: 2.4250 0.0229 0.6678 1.4530 6.1794 2.0890 1.8649 0.5419 1.4689 0.2734 2.8353 1.9363 0.0275 1.1228 2.9530 7.5414 4.0732 1.0499 1.3431 8.9111 1.5327 2.7055 2.2033 5.1058 2.1382 2.2567 0.1094 7.5532 9.4566 0.6504 11.3711 12.0702 23.1634 15.9385 7.7020 3.0333 1.0660 5.5504 1.5574 10.2426 41.4209 10.7607 8.8444 2.5655 19.6563 8.2115 142.0392 10.4467 37.1067 4.3368 14.4067 0.1404 8.6810 27.0358 23.9983 3.0480 3.1200 0.8130 0.0474 3.7946 9.0850 25.1321 9.4899 18.0209 13.4566 2.2578 15.6447 13.7446 48.4683 2.8522 56.2392 182.2965 0.9653 66.8961 20.1771 64.2408 48.0514 9.7904 33.2977 32.5828 181.9181 171.9305 28.5597 20.4399 8.2161 5.5320 5.2736 72.4845 25.1491 35.3975 14.8622 21.2843 55.6126 91.4130 174.6199 23.1996 112.8544 11.5361 4.2557 57.9729 173.5424 19.7958 8.8334 22.9666 13.4117 12.3601 12.8391 11.1906 0.1512 10.6258 13.5969 12.5366 1.8669 34.0664 2.8129 4.9411 146.3680
temp: 298.150 k
press: 1.00000 atm
elementType: 8 8 8 8 7 7 7 7 6 6 6 6 6 6 6 6 6 6 6 6 6 6 6 6 6 1 1 1 1 1 1 1 1 1 1 1 1 1 1 1 1
symmnumber: 1
zpe: 799915.1 jmol-1
zpe.correction: 0.304672 hartree
zpe.thermalcorrener: 0.328280 hartree
zpe.thermalcorrenthalpy: 0.329225 hartree
zpe.thermalcorrgfe: 0.248198 hartree
zpe.sumelectzpe: -1175.407165 hartree
zpe.sumelectthermal: -1175.383556 hartree
zpe.sumelectthermalent: -1175.382611 hartree
zpe.sumelectthermalfe: -1175.463638 hartree
dipole: -4.3039 -0.9138 -0.1982
dipole: 4.4043
quadrupole: -111.9960 -151.9499 -147.9067
quadrupole: -0.1262 10.6324 10.9920
quadrupole: 25.2882 -14.6657 -10.6225 -0.1262 10.6324 10.9920
hfenergy: -1175.7118361 hartree
pointgroup: C01 [X(C17H16N4O4)]
dipole: -1.62125 -0.6099284 0.0457133 debye
polarizability: 365.662334|14.8083461|288.5619721|-4.512593|-33.9773474|137.6539295 unknown
InChI: InChI=1S/C17H16N4O4/c1-11-8-9-14(15(10-11)21(24)25)19-20-16(12(2)22)17(23)18-13-6-4-3-5-7-13/h3-10,16,18H,1-2H3
charge 0 multiplicity 1
41 atoms
O  2.789726 2.420502 -0.761493
O  -0.741948 4.275024 -0.275828
O  -1.711255 -3.037161 2.062868
O  -0.167202 -1.567142 1.259939
N  2.035329 0.406193 0.189106
N  -0.540061 1.606034 -0.180477
N  -1.077583 0.80951 0.687353
N  -1.391756 -1.991109 1.378521
C  0.591372 2.372031 0.418237
C  -2.227906 0.088561 0.25377
C  1.928083 1.746879 -0.126616
C  -4.713978 -1.251574 -0.254007
C  -2.456323 -1.243802 0.696811
C  -3.682754 -1.901765 0.458234
C  0.382547 3.877804 0.123786
C  3.114567 -0.48339 -0.110387
C  -3.264333 0.738121 -0.466991
C  -4.476409 0.074211 -0.720136
C  -6.034174 -1.943132 -0.530771
C  2.992044 -1.820656 0.357474
C  4.270716 -0.086529 -0.834129
C  1.527763 4.815503 0.426954
C  4.018374 -2.751103 0.102209
C  5.287842 -1.034425 -1.079918
C  5.173737 -2.365092 -0.617613
H  0.601156 2.247276 1.525796
H  -3.803442 -2.926385 0.821359
H  1.237064 -0.029487 0.672842
H  -3.091715 1.766771 -0.800152
H  -5.26033 0.589156 -1.287718
H  -6.059056 -2.959745 -0.105454
H  -6.878844 -1.374664 -0.099313
H  -6.2205 -2.025063 -1.617765
H  2.098334 -2.126279 0.913136
H  4.360093 0.940357 -1.191481
H  1.9421 4.62508 1.435333
H  2.348742 4.6200 -0.287239
H  1.184497 5.858461 0.350939
H  3.914218 -3.778727 0.467244
H  6.17767 -0.724412 -1.639252
H  5.970894 -3.090128 -0.813671
