program: Gaussian 09
title: 000221480
version: EM64L-G09RevD.01
frameworkgroup: C1[X(C10H10N2O5S)]
method: RPBEPBE
basis: SDD
operation: Freq
keyword: #p
keyword: freq=noraman
keyword: PBEPBE/SDD
title: #p freq=noraman PBEPBE/SDD
converged: YES YES NO NO
title: Mulliken charges:
elementType: S O O O O O N N C C C C C C C C C C H H H H H H H H H H
charge: 0.913306 -0.229817 -0.153647 -0.260597 -0.529178 -0.496117 -0.109696 -0.343183 -0.463013 -0.392124 0.230130 0.284315 -0.057491 -0.223068 -0.249195 -0.227808 -0.204063 -0.210348 0.259397 0.255678 0.236799 0.266183 0.342343 0.338290 0.294854 0.245453 0.244230 0.238369
chargesum: 0.00000
title: Mulliken charges with hydrogens summed into heavy atoms:
elementType: S O O O O O N N C C C C C C C C C C
charge: 0.913306 -0.229817 -0.153647 -0.260597 -0.529178 -0.496117 -0.109696 -0.000840 0.052061 0.110858 0.230130 0.284315 -0.057491 0.115222 0.045658 0.017646 0.040167 0.028021
polarizability: 2.74080332e+02 -3.06715497e+00 1.69387488e+02 1.03441083e+00 -4.95110266e+00 9.81918411e+01
1716.lowfreq: -3.4671 -0.0011 -0.0008 0.0005 3.1814 7.1621 29.7457 42.6016 54.3518
frequency: 29.6823 42.6001 54.3014 65.9481 79.1297 99.9663 128.1949 141.1182 144.8824 184.5378 234.3443 242.1585 276.6405 305.2650 345.2419 363.3043 393.7041 405.2034 421.1264 427.8540 439.3805 466.0614 493.0650 555.4028 572.8757 586.3495 599.9698 649.2828 662.9972 684.4962 700.2945 706.6912 759.6083 792.5994 852.7029 900.4965 918.7965 932.0294 944.8435 968.4508 991.1866 997.9200 1004.0420 1007.8806 1041.8149 1052.8686 1074.4251 1084.6033 1125.7841 1155.5932 1174.0176 1192.3724 1213.3492 1248.1585 1300.9613 1319.3740 1325.8785 1375.9442 1381.6085 1419.1999 1436.6866 1439.3403 1456.3152 1486.0359 1569.3525 1596.9260 1648.7232 1679.8192 2993.9055 3007.1481 3081.2883 3102.0142 3112.4633 3139.7540 3153.9129 3165.3816 3175.2465 3560.5586
redmass: 5.7426 5.3011 5.4789 7.8410 7.6252 5.9057 7.9417 5.1002 9.3916 6.0225 3.7607 8.5273 4.6819 7.2420 10.7734 12.1803 11.8111 2.9505 7.0140 9.1929 4.1411 5.7704 4.6063 2.6824 1.8144 3.6162 6.4642 7.1374 6.1123 2.7198 4.8363 4.0335 1.3264 17.6844 1.2353 2.4058 17.9355 2.4652 1.3440 6.0325 1.3778 6.9610 3.9348 1.4438 1.9844 2.0726 2.4271 1.6123 3.5662 6.5954 1.0662 1.1375 1.3411 1.6296 2.9276 1.2757 1.4029 1.4426 7.5359 1.5238 2.2458 1.0933 1.8952 1.0903 5.5650 6.7137 10.6156 8.3977 1.0674 1.0637 1.0992 1.0972 1.0948 1.0867 1.0909 1.0956 1.1009 1.0774
irintensity: 4.4964 1.6474 2.6674 4.4509 0.0827 2.9271 5.6612 2.5437 4.6393 2.4303 2.8420 16.5005 5.9552 8.4657 20.9238 21.4949 9.7115 0.5598 9.9668 23.8348 10.9115 49.7161 36.1320 69.9278 85.1546 8.5510 1.4684 3.0650 14.9458 23.3729 24.8356 9.6695 84.0282 55.6233 0.3362 28.9245 49.2144 27.5311 3.3916 5.3848 0.0904 0.9634 0.9776 0.8640 18.4042 51.3215 129.9839 5.2402 16.1630 288.0290 0.2729 15.1753 22.9723 80.6416 267.7543 2.8217 7.5121 28.6815 13.1951 9.3660 19.9719 16.2462 26.4540 15.8677 3.1765 4.8431 332.2891 215.1605 25.6371 11.0343 30.3238 5.5243 64.0781 1.8556 6.4132 4.0339 35.5179 61.9574
temp: 298.150 k
press: 1.00000 atm
elementType: 16 8 8 8 8 8 7 7 6 6 6 6 6 6 6 6 6 6 1 1 1 1 1 1 1 1 1 1
symmnumber: 1
zpe: 513577.5 jmol-1
zpe.correction: 0.195611 hartree
zpe.thermalcorrener: 0.212648 hartree
zpe.thermalcorrenthalpy: 0.213592 hartree
zpe.thermalcorrgfe: 0.149511 hartree
zpe.sumelectzpe: -1269.242290 hartree
zpe.sumelectthermal: -1269.225253 hartree
zpe.sumelectthermalent: -1269.224309 hartree
zpe.sumelectthermalfe: -1269.288390 hartree
dipole: -0.9178 4.9349 2.1376
dipole: 5.4557
quadrupole: -65.7074 -119.6010 -117.5012
quadrupole: -8.7198 -8.5677 1.1274
quadrupole: 35.2292 -18.6645 -16.5647 -8.7198 -8.5677 1.1274
hfenergy: -1269.4379012 hartree
pointgroup: C01 [X(C10H10N2O5S1)]
dipole: -0.4570261 -2.0923433 -0.1429859 debye
polarizability: 273.7215725|-3.2712548|158.6498229|-8.3384629|-25.7499159|109.2882666 unknown
InChI: InChI=1S/C6H5O2S.C4H5N2O3/c7-9(8)6-4-2-1-3-5-6;7-3-1-2-5-4(8)6(3)9/h1-5H;5H,1-2H2
charge 0 multiplicity 1
28 atoms
S  0.529444 1.270743 -0.684233
O  -0.581506 1.111871 1.196865
O  -2.71824 2.669551 0.518212
O  -0.862874 -1.618096 1.243692
O  -0.464587 0.277285 -1.533147
O  0.893133 2.737336 -1.289543
N  -1.760609 0.546275 0.84051
N  -2.912766 -1.425682 0.144762
C  -4.135799 0.700231 0.094316
C  -3.82726 -0.600555 -0.666531
C  -2.856321 1.432114 0.478646
C  -1.789008 -0.923559 0.757725
C  2.151852 0.41455 -0.224751
C  2.098441 -0.807073 0.464392
C  3.33486 1.07573 -0.598561
C  3.337081 -1.418461 0.772535
C  4.556299 0.440183 -0.278294
C  4.555302 -0.801389 0.401034
H  -4.707716 0.476906 1.015718
H  -4.735829 1.389919 -0.520417
H  -4.754986 -1.170566 -0.839615
H  -3.366704 -0.368809 -1.646902
H  -2.932294 -2.443106 0.057366
H  1.144431 -1.252767 0.772322
H  3.298555 2.039503 -1.115729
H  3.341762 -2.37064 1.312684
H  5.500997 0.917533 -0.558148
H  5.506639 -1.284125 0.649591
