program: Gaussian 09
title: 000221469
version: EM64L-G09RevD.01
frameworkgroup: C1[X(C17H25NO)]
method: RPBEPBE
basis: SDD
operation: Freq
keyword: #p
keyword: freq=noraman
keyword: PBEPBE/SDD
title: #p freq=noraman PBEPBE/SDD
converged: YES YES NO NO
title: Mulliken charges:
elementType: O N C C C C C C C C C C C C C C C C C H H H H H H H H H H H H H H H H H H H H H H H H H
charge: -0.305899 -0.128523 -0.426632 -0.393960 -0.353445 -0.336142 -0.333482 -0.340557 0.191353 -0.692970 -0.697607 -0.305811 -0.284032 0.470284 -0.376505 -0.388545 -0.237226 -0.238220 -0.238887 0.216960 0.219154 0.254868 0.198435 0.219224 0.202795 0.231720 0.177622 0.195731 0.192032 0.187211 0.205531 0.213908 0.218017 0.213974 0.217300 0.216130 0.207834 0.213067 0.269214 0.222316 0.237666 0.226052 0.229286 0.230757
chargesum: 0.00000
title: Mulliken charges with hydrogens summed into heavy atoms:
elementType: O N C C C C C C C C C C C C C C C C C
charge: -0.305899 -0.128523 0.009482 0.059343 0.068574 0.073201 0.054280 0.052185 0.191353 -0.047071 -0.056343 -0.092744 -0.014818 0.470284 -0.154189 -0.150879 -0.011173 -0.008934 -0.008130
polarizability: 3.22510224e+02 1.12603960e+01 1.93993936e+02 -7.34280044e+00 2.23941256e+01 1.30172678e+02
1716.lowfreq: -5.4467 -0.0006 -0.0004 0.0005 4.6206 4.9999 16.1968 26.8129 29.4769
frequency: 14.8529 26.6836 29.3494 31.8057 62.8738 64.1656 68.4144 84.5071 101.3384 115.0655 120.6427 146.1261 171.5323 207.8027 224.2553 230.2734 235.6094 243.5527 275.5759 293.3229 322.8205 394.8689 397.8425 402.9168 428.0105 477.6252 498.2993 542.3171 588.6924 616.0853 649.0654 676.4187 699.3348 733.7981 736.1769 772.9280 788.9739 792.1271 799.1801 845.9076 872.3592 876.3881 899.3554 901.6827 923.3587 923.6721 924.7143 977.2216 986.4656 990.9695 994.3740 1009.4583 1014.5043 1025.3471 1033.2360 1070.2298 1072.3512 1082.9489 1098.9041 1110.5935 1113.5733 1143.3911 1173.1248 1190.4048 1199.6566 1205.9836 1217.0634 1243.5968 1262.9687 1268.9687 1269.3392 1285.2785 1288.8457 1294.5904 1301.4475 1320.4861 1333.7111 1340.0682 1345.5131 1358.0458 1366.9810 1383.9083 1390.9519 1395.4759 1411.0747 1439.5730 1445.6244 1468.3590 1468.7100 1474.0607 1476.2154 1476.7600 1478.7751 1485.3618 1486.2185 1487.6978 1498.3264 1545.3917 1582.0149 1610.6538 1646.2022 2962.0398 2963.6061 2970.4421 2973.6217 2975.8444 2977.5598 2985.3096 2995.4060 3003.5110 3010.9528 3028.6768 3042.5291 3054.2849 3068.5824 3072.7798 3073.0688 3075.2281 3076.1379 3101.3727 3122.7873 3125.8260 3138.7147 3145.7117 3149.6934 3165.6665
redmass: 3.5686 4.3546 3.6995 4.6238 3.4317 1.6573 1.5871 3.2794 6.2498 2.4116 2.4302 3.0155 2.8528 3.4202 2.0152 1.2156 1.4295 3.6554 3.4164 3.7167 3.5456 2.9788 2.7543 2.7638 2.7960 3.7162 3.2878 5.3189 4.9715 6.3868 4.0911 4.3685 1.6858 1.0751 1.0817 2.0085 1.2075 1.2471 4.5980 1.2965 1.8275 3.7617 1.7768 1.7314 1.4524 1.2254 1.3610 1.3877 4.1081 3.7750 1.3194 3.5190 1.2695 2.3384 2.9073 2.4913 2.5202 1.6074 1.6725 2.2826 2.3583 2.0189 1.0640 1.1246 2.2025 1.6528 1.5486 1.7589 1.3880 1.2813 1.3534 1.0914 1.1811 1.5577 1.2592 1.3501 1.2714 1.3861 1.4862 1.4563 1.3562 6.3953 1.2164 1.2178 2.4338 2.2407 1.1649 1.0728 1.0735 1.0747 1.0653 1.0457 1.0417 2.2838 1.0821 1.0808 1.1323 5.5470 5.7121 5.9560 5.7461 1.0592 1.0592 1.0627 1.0373 1.0419 1.0538 1.0651 1.0603 1.0990 1.0964 1.1018 1.0975 1.1049 1.1002 1.0997 1.1005 1.0995 1.1017 1.0895 1.0850 1.0877 1.0916 1.0907 1.0952 1.1016
irintensity: 0.0130 0.3824 0.0339 1.3750 0.9527 0.2769 0.0521 0.8879 1.2997 0.2047 0.2201 0.0223 0.0083 0.5493 0.2712 0.1099 0.3241 0.5175 1.1357 0.6725 6.3783 8.9807 3.2625 0.0248 3.8616 3.6323 19.4760 16.6939 9.3737 0.1711 1.5412 9.3916 39.5375 7.5751 14.9778 66.1178 0.4243 2.3786 0.0814 1.0009 10.0555 6.6709 4.6568 10.8323 0.3383 4.4229 6.8303 0.1298 2.2683 0.3036 3.4981 1.0678 40.2729 3.4756 0.6391 0.0181 0.9861 10.6804 14.8767 21.6336 17.7330 113.8408 0.7477 4.6609 15.8955 54.1756 11.4720 17.9374 7.2060 1.8572 4.2367 1.3088 6.0174 37.4476 7.2201 31.5792 8.3591 4.4618 1.5730 19.7643 8.0732 0.9260 9.6329 12.9332 171.9925 13.6829 39.7346 0.4751 2.6886 5.6795 7.2269 10.7615 11.3704 29.4718 11.2385 19.3649 18.3381 173.4949 7.8642 0.2624 106.9561 24.9209 17.3770 30.3727 46.4182 23.6149 18.6465 70.0421 58.1942 4.2035 9.5908 5.5519 16.6117 51.8547 34.5755 94.7424 31.9177 47.5328 75.4480 0.3564 6.9199 0.3428 12.9289 5.0007 52.9209 30.7529
temp: 298.150 k
press: 1.00000 atm
elementType: 8 7 6 6 6 6 6 6 6 6 6 6 6 6 6 6 6 6 6 1 1 1 1 1 1 1 1 1 1 1 1 1 1 1 1 1 1 1 1 1 1 1 1 1
symmnumber: 1
zpe: 999677.5 jmol-1
zpe.correction: 0.380757 hartree
zpe.thermalcorrener: 0.401914 hartree
zpe.thermalcorrenthalpy: 0.402858 hartree
zpe.thermalcorrgfe: 0.326883 hartree
zpe.sumelectzpe: -791.328056 hartree
zpe.sumelectthermal: -791.306899 hartree
zpe.sumelectthermalent: -791.305954 hartree
zpe.sumelectthermalfe: -791.381929 hartree
dipole: -0.0984 3.5995 1.7495
dipole: 4.0034
quadrupole: -98.0455 -115.9240 -120.9331
quadrupole: 5.2165 -0.3646 1.5103
quadrupole: 13.5887 -4.2898 -9.2989 5.2165 -0.3646 1.5103
hfenergy: -791.7088127 hartree
pointgroup: C01 [X(C17H25N1O1)]
dipole: 0.0168298 1.4185416 0.6842619 debye
polarizability: 323.5059469|4.1431249|193.3327027|-1.6153391|22.6351675|129.8381885 unknown
InChI: InChI=1S/C17H25NO/c1-3-5-14-18(15-6-4-2)17(19)13-12-16-10-8-7-9-11-16/h7-13H,3-6,14-15H2,1-2H3
charge 0 multiplicity 1
44 atoms
O  0.927949 -1.927596 -1.04005
N  1.909899 -0.022274 -0.132151
C  1.867911 1.273585 0.581018
C  3.241351 -0.527077 -0.542223
C  1.59655 2.48631 -0.342094
C  3.945082 -1.341533 0.568584
C  1.628997 3.828261 0.423754
C  5.338569 -1.844234 0.128356
C  0.793358 -0.802474 -0.444105
C  1.331835 5.039891 -0.485598
C  6.054343 -2.652519 1.231868
C  -0.55315 -0.27587 -0.068787
C  -1.670911 -1.005413 -0.363944
C  -3.071363 -0.650274 -0.087752
C  -3.461818 0.551154 0.574447
C  -4.095711 -1.549864 -0.502181
C  -4.820427 0.837806 0.808514
C  -5.457198 -1.26394 -0.268505
C  -5.826424 -0.067499 0.388227
H  1.119546 1.238803 1.394513
H  2.848298 1.408992 1.076809
H  3.095512 -1.170828 -1.426793
H  3.867894 0.338827 -0.835259
H  0.612708 2.359343 -0.835764
H  2.352092 2.500854 -1.153135
H  3.301911 -2.202722 0.831594
H  4.048824 -0.721255 1.48336
H  2.622928 3.956799 0.89951
H  0.890528 3.798084 1.251687
H  5.968918 -0.979247 -0.165625
H  5.227392 -2.472612 -0.778236
H  0.329807 4.953684 -0.945948
H  1.363301 5.988026 0.081615
H  2.070889 5.111686 -1.305484
H  5.455895 -3.53531 1.524842
H  7.043582 -3.011648 0.893325
H  6.20966 -2.037099 2.138262
H  -0.633275 0.695414 0.429729
H  -1.491148 -1.964213 -0.872351
H  -2.699047 1.263297 0.909091
H  -3.811579 -2.478337 -1.012361
H  -5.101508 1.76588 1.319063
H  -6.227589 -1.970255 -0.596952
H  -6.882578 0.158792 0.571828
