program: Gaussian 09
title: 000221478
version: EM64L-G09RevD.01
frameworkgroup: C1[X(C22H26O4)]
method: RPBEPBE
basis: SDD
operation: Freq
keyword: #pfreq=noraman
keyword: PBEPBE/SDD
title: #p freq=noraman PBEPBE/SDD
converged: YES YES NO NO
title: Mulliken charges:
elementType: O O O O C C C C C C C C C C C C C C C C C C C C C C H H H H H H H H H H H H H H H H H H H H H H H H H H
charge: -0.286125 -0.286523 -0.227956 -0.227355 0.072973 -0.394978 0.450223 0.428914 -0.785517 -0.729598 -0.422790 -0.413988 -0.360827 -0.356505 -0.350878 -0.349990 -0.428009 -0.429498 0.343666 0.345094 0.247448 0.247096 -0.484679 -0.484643 -0.657411 -0.657175 0.213179 0.194656 0.232057 0.214683 0.236070 0.216472 0.238699 0.210613 0.247137 0.247724 0.253313 0.250683 0.298963 0.299042 0.254209 0.254103 0.246240 0.246336 0.246374 0.246435 0.229652 0.216347 0.229932 0.229338 0.216457 0.230317
chargesum: 0.00000
title: Mulliken charges with hydrogens summed into heavy atoms:
elementType: O O O O C C C C C C C C C C C C C C C C C C C C C C
charge: -0.286125 -0.286523 -0.227956 -0.227355 0.072973 0.012857 0.450223 0.428914 -0.102706 -0.063815 -0.175653 -0.166263 -0.107514 -0.105822 -0.051914 -0.050949 -0.173800 -0.175395 0.343666 0.345094 0.247448 0.247096 0.007896 0.008167 0.018520 0.018937
polarizability: 3.69331956e+02 -3.59367213e+00 2.33173506e+02 2.17039260e+01 -9.60186338e-01 1.90675796e+02
1716.lowfreq: -5.4684 -0.4711 -0.0009 -0.0007 0.0010 3.6022 10.9557 17.7626 26.5466
frequency: 10.8195 17.7507 26.4497 31.3776 33.4162 41.6904 44.3935 54.0842 68.3860 82.2197 88.4900 95.2304 129.0370 136.6116 173.2429 180.3737 191.0192 197.5151 204.7687 228.4523 238.8912 264.9188 272.7579 284.2261 301.7994 312.9458 336.1954 350.7015 367.6567 378.8661 384.0034 391.2817 408.8568 412.9544 459.5035 498.1743 530.0095 532.0725 547.1916 569.6218 586.1151 614.7296 620.8754 639.1319 661.6322 668.1511 733.5333 741.6344 747.2056 771.6582 787.0989 791.3943 791.4032 820.5469 840.5745 843.7766 846.3169 852.6249 854.1745 857.7828 885.4115 963.7754 968.6317 979.2321 981.7609 983.9105 1005.0863 1006.1589 1010.5225 1011.2712 1015.4115 1045.4001 1072.1724 1073.3178 1084.4580 1084.7558 1086.9352 1105.3937 1109.3988 1112.1124 1113.6255 1127.9085 1151.7962 1154.6352 1159.6066 1203.7397 1206.6977 1208.2547 1224.7545 1242.8996 1243.0463 1296.1887 1304.8210 1306.5743 1325.1359 1334.9984 1335.1196 1363.3394 1367.8304 1385.4311 1396.7221 1399.4766 1400.2983 1407.9316 1409.0900 1440.8109 1441.6176 1464.2904 1471.8715 1471.9084 1474.2823 1479.5197 1480.2047 1480.7438 1486.7194 1488.3451 1490.2012 1492.0187 1578.7403 1581.4123 1612.4316 1615.2016 1652.4413 1652.9682 2971.5238 2982.9526 2986.0745 2997.4141 2997.4571 3000.6117 3000.7212 3026.9592 3044.2937 3044.3123 3072.4306 3080.8143 3082.1765 3087.3512 3097.5458 3097.8512 3103.0470 3103.3652 3132.0261 3132.5179 3157.7628 3159.4706 3165.8775 3165.9441 3207.7808 3209.0439
redmass: 3.1745 4.1418 2.9419 6.5840 2.5131 2.9685 3.7346 3.8733 3.9266 3.6886 4.2886 3.2399 2.2183 3.3644 2.9475 1.7966 1.4211 2.1428 2.6597 3.6021 1.6684 3.4406 2.1418 2.9796 2.1953 2.4230 4.3278 3.9766 3.4504 4.5056 4.0987 4.9729 2.9802 2.9994 3.5453 3.1621 2.7527 2.7642 3.0319 3.0165 3.8754 5.6113 6.6364 5.3354 4.7709 5.5073 4.2553 3.6955 3.3513 5.7869 1.6474 1.3406 1.3401 2.0962 1.3340 1.5179 1.4220 2.4699 4.7353 2.1272 1.9574 1.3931 1.3627 1.4146 1.3854 1.7064 3.0347 2.6471 1.8415 1.8566 1.8298 1.8158 2.9643 2.9786 1.6013 1.6014 2.2974 2.2228 2.3215 1.9702 2.1037 1.6068 2.2869 2.3781 2.3233 1.3998 2.8783 1.5500 2.5704 1.1731 1.1731 1.3240 1.2770 1.2921 1.4269 1.7436 1.7528 5.7094 6.3535 1.2283 1.2105 1.2143 1.2144 3.3164 3.5478 1.0853 1.0853 1.0957 1.0389 1.0390 1.0509 1.1167 1.0526 1.0518 1.1225 1.0913 2.0246 1.9729 7.2263 7.3237 6.3715 6.4213 9.6875 9.6844 1.0583 1.0355 1.0366 1.0537 1.0548 1.0433 1.0422 1.1012 1.0988 1.0987 1.0992 1.0991 1.0999 1.0999 1.1003 1.1003 1.1004 1.1004 1.0889 1.0888 1.0894 1.0890 1.0954 1.0954 1.0943 1.0943
irintensity: 0.8170 0.4142 0.3720 1.9451 0.7715 3.0827 0.2648 0.1718 0.9237 1.2199 0.2760 1.1739 0.2701 0.1680 0.3020 0.0402 0.6834 1.1220 0.4040 1.0506 0.3185 1.3749 3.8630 8.5616 3.4602 3.5167 9.5194 7.8267 1.7711 0.3040 0.1097 0.1809 0.5229 0.2265 0.6215 3.8602 4.6433 0.2801 17.2705 17.0588 6.6327 0.6967 1.7879 0.0538 2.3788 3.1746 3.7789 3.1016 3.5110 4.0609 7.2998 18.9967 13.6615 21.4297 14.1651 30.9686 16.6761 40.4828 1.0217 38.6853 16.4684 1.7462 0.4646 0.6644 1.7311 2.4181 24.1197 6.9630 71.4644 78.3525 6.9839 66.3241 375.9698 37.1765 0.1238 0.0543 9.0732 243.7662 145.9817 283.8089 236.3920 53.5418 239.6781 61.1438 29.4286 49.0317 6.6224 79.1398 14.5945 0.0390 0.0469 17.9772 1.6698 2.4719 8.9451 74.9099 23.9429 32.6955 0.5070 12.8304 13.9465 21.5714 21.4646 12.7456 9.7526 27.5129 27.9282 13.6769 12.6044 12.6168 13.7565 16.9914 22.8687 18.9303 35.6786 8.6673 123.9820 86.2101 11.2130 5.4555 7.2358 0.8597 311.0108 55.4979 43.1209 15.1989 37.9332 53.0571 15.7412 12.5363 12.9884 20.8288 3.8413 3.7956 41.9196 53.2669 11.7175 52.6269 28.9693 28.9389 31.5787 31.1929 6.5409 17.6844 12.2807 11.9202 2.3298 2.8946 2.3495 2.3743
temp: 298.150 k
press: 1.00000 atm
elementType: 8 8 8 8 6 6 6 6 6 6 6 6 6 6 6 6 6 6 6 6 6 6 6 6 6 6 1 1 1 1 1 1 1 1 1 1 1 1 1 1 1 1 1 1 1 1 1 1 1 1 1 1
symmnumber: 1
zpe: 1115914.9 jmol-1
zpe.correction: 0.425030 hartree
zpe.thermalcorrener: 0.452292 hartree
zpe.thermalcorrenthalpy: 0.453237 hartree
zpe.thermalcorrgfe: 0.362648 hartree
zpe.sumelectzpe: -1152.926904 hartree
zpe.sumelectthermal: -1152.899641 hartree
zpe.sumelectthermalent: -1152.898697 hartree
zpe.sumelectthermalfe: -1152.989286 hartree
dipole: 0.1358 -1.4290 -0.3563
dipole: 1.4790
quadrupole: -153.1155 -140.7955 -153.8540
quadrupole: 2.2392 -14.9698 1.3141
quadrupole: -3.8605 8.4595 -4.5990 2.2392 -14.9698 1.3141
hfenergy: -1153.3519335 hartree
pointgroup: C01 [X(C22H26O4)]
dipole: 0.0549744 0.5688275 0.1094707 debye
polarizability: 365.3850513|3.7902597|233.0546553|-33.9470016|-3.5014629|194.7415511 unknown
InChI: InChI=1S/C22H26O4/c1-5-20(23)25-18-12-8-16(9-13-18)22(4,7-3)17-10-14-19(15-11-17)26-21(24)6-2/h8-15H,5-7H2,1-4H3
charge 0 multiplicity 1
52 atoms
O  -4.752419 1.339717 -0.224431
O  4.63915 1.40722 0.338947
O  -6.220321 0.37898 1.351262
O  5.994813 0.888753 -1.519771
C  -0.015825 -2.042431 -0.156845
C  0.058316 -3.051454 1.045189
C  -1.290597 -1.15905 -0.072607
C  1.23847 -1.135649 -0.112205
C  -0.1208 -2.848384 -1.486214
C  1.33419 -3.917908 1.101809
C  -2.386616 -1.446404 0.775774
C  2.283142 -1.207847 -1.063033
C  -1.407281 -0.033382 -0.935078
C  1.383504 -0.205122 0.954397
C  -3.564426 -0.66023 0.781449
C  3.43961 -0.394698 -0.97964
C  -2.565513 0.76193 -0.951479
C  2.521986 0.611171 1.064036
C  -3.643527 0.444006 -0.094277
C  3.547694 0.513835 0.095548
C  -5.962921 1.250415 0.495914
C  5.784543 1.539088 -0.475739
C  -6.876407 2.382149 0.051067
C  6.695215 2.592398 0.136091
C  -8.229467 2.377728 0.782872
C  7.967591 2.834386 -0.693978
H  -0.028023 -2.48276 1.992239
H  -0.82204 -3.722546 0.994162
H  -0.159277 -2.17833 -2.363369
H  0.727411 -3.542856 -1.619001
H  -1.050208 -3.445031 -1.480576
H  1.30081 -4.582705 1.984422
H  2.243487 -3.296615 1.180193
H  1.438794 -4.561691 0.20972
H  -2.346616 -2.298054 1.46091
H  2.21372 -1.909045 -1.89979
H  -0.571224 0.230663 -1.592653
H  0.584597 -0.109277 1.698536
H  -4.393824 -0.903778 1.445713
H  4.229255 -0.46639 -1.727814
H  -2.65294 1.628192 -1.614219
H  2.632815 1.328679 1.882672
H  -6.335594 3.334994 0.209286
H  -7.010613 2.296528 -1.044459
H  6.942139 2.267411 1.165257
H  6.106336 3.522293 0.252763
H  -8.091788 2.48102 1.872732
H  -8.857285 3.213998 0.428491
H  -8.772825 1.43361 0.607421
H  7.717958 3.177964 -1.71231
H  8.59755 3.601354 -0.210343
H  8.558485 1.908056 -0.794044
