program: Gaussian 09
title: 000221462
version: EM64L-G09RevD.01
frameworkgroup: C1[X(C15H21Cl2NO)]
method: RPBEPBE
basis: SDD
operation: Freq
keyword: #p
keyword: freq=noraman
keyword: PBEPBE/SDD
title: #p freq=noraman PBEPBE/SDD
converged: YES YES NO NO
title: Mulliken charges:
elementType: Cl Cl O N C C C C C C C C C C C C C C C H H H H H H H H H H H H H H H H H H H H H
charge: -0.034933 -0.040798 -0.256635 -0.097156 -0.373190 -0.396622 -0.342068 -0.326535 -0.340600 -0.337110 0.087381 0.398364 -0.696653 -0.692829 -0.281631 -0.347040 -0.215126 -0.227406 -0.093536 0.250031 0.200165 0.241517 0.214646 0.236377 0.186771 0.203790 0.194881 0.188568 0.203967 0.193870 0.200955 0.218481 0.216699 0.209358 0.213901 0.220111 0.211663 0.261468 0.284379 0.262524
chargesum: 0.00000
title: Mulliken charges with hydrogens summed into heavy atoms:
elementType: Cl Cl O N C C C C C C C C C C C C C C C
charge: -0.034933 -0.040798 -0.256635 -0.097156 0.077006 0.059541 0.081080 0.072136 0.051935 0.057716 0.087381 0.398364 -0.052114 -0.047154 -0.281631 -0.085572 0.069253 0.035117 -0.093536
polarizability: 2.55286700e+02 6.63350568e+00 1.61423989e+02 3.08492503e+00 1.15091543e+01 1.60977988e+02
1716.lowfreq: -11.7847 -5.3154 -0.0016 0.0009 0.0020 7.2965 15.8914 22.7104 27.4957
frequency: 15.6760 22.1675 27.4002 33.8413 51.1240 60.9458 66.6737 87.2181 106.8903 115.1553 127.5570 155.1701 160.1815 173.4260 179.9456 221.1280 232.8823 244.0246 255.0444 278.8831 292.4978 361.4809 369.9260 375.3931 393.9255 401.0685 432.5269 472.1535 488.2804 542.3772 575.4746 650.8703 684.3359 704.7502 730.0694 731.6865 737.4566 768.2265 786.0707 790.2578 828.2991 865.9090 893.3481 901.5969 907.3426 922.8233 945.1803 956.6273 1012.6746 1014.5055 1030.2429 1070.2982 1073.9233 1081.8350 1096.5151 1106.8929 1111.1730 1114.8354 1138.9310 1187.1600 1199.7359 1226.3870 1246.6816 1254.9133 1263.6108 1269.4555 1284.7870 1287.2019 1295.3907 1308.6799 1339.6569 1344.2163 1346.2736 1356.3973 1364.1781 1375.0107 1391.2247 1391.9976 1416.4562 1446.7512 1455.3952 1465.1407 1468.8519 1469.3522 1477.0926 1477.9535 1478.2562 1478.8860 1487.9139 1488.7976 1560.3560 1566.4472 1588.0367 2963.9925 2964.2255 2973.2146 2975.2065 2975.7331 2977.7980 2993.2323 3001.3366 3005.8498 3011.2701 3034.1730 3044.8764 3070.0404 3071.2805 3074.2266 3075.7106 3076.8900 3081.3228 3151.7875 3179.5829 3184.3721
redmass: 6.5400 3.8323 5.0609 5.8506 2.0621 3.1930 3.2267 1.8052 2.6034 2.3427 5.9607 4.1128 4.4743 5.3519 10.3483 2.9477 1.1570 1.1446 5.1807 4.1901 3.6614 5.6953 3.0312 4.9448 4.6164 3.5868 3.0550 4.7367 6.9400 5.1667 3.6369 6.7650 4.5158 6.6902 1.4773 2.2661 1.0975 5.5691 1.1982 1.2654 1.4845 1.3964 2.2134 1.7433 1.9181 1.2287 1.5734 1.4007 3.9853 4.1607 3.5481 2.4882 2.5327 2.6980 1.7322 2.0531 2.2677 2.3631 1.4109 2.2652 2.1628 1.5660 1.6099 1.4045 1.2864 1.2767 1.1638 1.2062 1.1131 1.2796 1.3734 2.9899 1.6701 1.4395 1.3914 4.9931 1.2132 1.2124 2.4662 1.1130 2.4377 1.2011 1.0965 1.0740 1.0631 1.0441 1.0723 1.0493 1.0857 1.0830 8.2142 6.9215 7.3066 1.0590 1.0591 1.0570 1.0383 1.0386 1.0617 1.0676 1.0639 1.0963 1.0956 1.1014 1.0987 1.1018 1.1005 1.1007 1.0994 1.1016 1.0992 1.0897 1.0961 1.0939
irintensity: 0.2306 0.0890 0.2764 1.2622 0.7526 0.9548 1.1234 0.4930 0.0425 0.0818 0.9797 0.7932 0.2039 1.2518 1.1285 0.0361 0.0706 0.2124 0.4241 1.1273 4.7629 4.0662 4.9251 3.4995 3.5452 4.4996 10.1147 8.0373 23.2307 11.6637 10.3641 2.5115 2.7674 10.2427 1.3030 15.4167 11.1010 47.5095 0.8455 1.7328 46.3710 20.5013 1.3463 10.1049 7.8004 6.7950 24.8493 0.8173 2.8036 22.2952 12.4608 0.4267 0.8805 35.6797 27.4050 42.4494 4.3049 17.6156 2.0227 2.3744 11.3969 25.6352 20.0632 3.2589 2.2468 0.9756 20.3156 40.1607 2.4671 25.6586 0.7617 10.0479 4.9320 12.4730 2.8012 5.8750 12.1909 8.1401 135.7985 22.3336 26.7856 5.1808 1.3430 0.0490 6.9214 11.3490 6.0474 11.3658 9.9783 23.6725 49.6627 247.4426 96.1994 14.2296 27.8061 21.5355 34.3278 38.4469 26.2740 42.9479 37.3022 1.5713 12.5462 29.3502 8.7196 11.6062 42.0282 67.0504 45.4280 62.1725 70.0537 1.6472 1.0666 1.1341
temp: 298.150 k
press: 1.00000 atm
elementType: 17 17 8 7 6 6 6 6 6 6 6 6 6 6 6 6 6 6 6 1 1 1 1 1 1 1 1 1 1 1 1 1 1 1 1 1 1 1 1 1
symmnumber: 1
zpe: 860844.0 jmol-1
zpe.correction: 0.327878 hartree
zpe.thermalcorrener: 0.349649 hartree
zpe.thermalcorrenthalpy: 0.350593 hartree
zpe.thermalcorrgfe: 0.272890 hartree
zpe.sumelectzpe: -1632.842808 hartree
zpe.sumelectthermal: -1632.821037 hartree
zpe.sumelectthermalent: -1632.820092 hartree
zpe.sumelectthermalfe: -1632.897796 hartree
dipole: -1.3645 4.0251 -1.3624
dipole: 4.4631
quadrupole: -127.1832 -131.4479 -130.8018
quadrupole: -1.9481 3.9698 6.0152
quadrupole: 2.6278 -1.6369 -0.9908 -1.9481 3.9698 6.0152
hfenergy: -1633.1706858 hartree
pointgroup: C01 [X(C15H21Cl2N1O1)]
dipole: -0.3774992 -1.6565262 0.4435266 debye
polarizability: 255.6780352|2.9798353|159.7886094|-3.9915774|11.0817026|162.2220328 unknown
InChI: InChI=1S/C15H21Cl2NO/c1-3-5-9-18(10-6-4-2)15(19)13-8-7-12(16)11-14(13)17/h7-8,11H,3-6,9-10H2,1-2H3
charge 0 multiplicity 1
40 atoms
Cl 0.329231 1.900301 1.988313
Cl 5.595295 1.236299 0.401226
O  -0.850968 1.536044 -1.726559
N  -1.205291 -0.281083 -0.309591
C  -2.645487 -0.292324 -0.667069
C  -0.719304 -1.324507 0.62069
C  -3.488082 0.626702 0.247097
C  -0.428853 -2.675434 -0.075109
C  -4.985173 0.604626 -0.134686
C  -0.000825 -3.768078 0.930534
C  -0.41124 0.70087 -0.870336
C  1.054614 0.753263 -0.474501
C  -5.840277 1.520693 0.766926
C  0.295592 -5.121021 0.248915
C  1.521909 1.324537 0.730061
C  2.029333 0.351106 -1.424542
C  2.891798 1.483877 1.018125
C  3.410715 0.484642 -1.172166
C  3.818864 1.049427 0.052182
H  -2.740576 0.04676 -1.714073
H  -3.007772 -1.335911 -0.604655
H  0.194114 -0.968787 1.125459
H  -1.485299 -1.465776 1.408236
H  -3.0952 1.657611 0.16699
H  -3.368518 0.315137 1.304861
H  0.370215 -2.527213 -0.829052
H  -1.328483 -3.013205 -0.628025
H  -5.368564 -0.435241 -0.076108
H  -5.095029 0.920034 -1.192028
H  -0.799176 -3.903533 1.689075
H  0.898441 -3.42716 1.482856
H  -5.495553 2.569517 0.702958
H  -6.905633 1.496098 0.473035
H  -5.774019 1.210016 1.826709
H  1.113247 -5.023328 -0.489494
H  0.597645 -5.885763 0.987407
H  -0.595602 -5.500551 -0.285386
H  1.691456 -0.055734 -2.383118
H  3.219892 1.934112 1.957731
H  4.149567 0.167074 -1.912487
