program: Gaussian 09
title: 000221461
version: EM64L-G09RevD.01
frameworkgroup: C1[X(C15H21Cl2NO)]
method: RPBEPBE
basis: SDD
operation: Freq
keyword: #p
keyword: freq=noraman
keyword: PBEPBE/SDD
title: #p freq=noraman PBEPBE/SDD
converged: YES YES NO NO
title: Mulliken charges:
elementType: Cl Cl O N C C C C C C C C C C C C C C C H H H H H H H H H H H H H H H H H H H H H
charge: -0.018511 -0.039502 -0.251429 -0.135987 -0.419697 -0.431805 -0.011590 -0.003599 -0.688020 -0.707331 -0.687787 -0.712691 0.126696 0.464436 -0.322152 -0.343985 -0.225098 -0.240842 -0.096894 0.226821 0.260683 0.229800 0.238514 0.195504 0.193433 0.206244 0.245003 0.204734 0.208191 0.205207 0.219871 0.212369 0.215001 0.229528 0.227307 0.203123 0.219337 0.258702 0.284178 0.262240
chargesum: 0.00000
title: Mulliken charges with hydrogens summed into heavy atoms:
elementType: Cl Cl O N C C C C C C C C C C C C C C C
charge: -0.018511 -0.039502 -0.251429 -0.135987 0.067807 0.036509 0.183913 0.189833 -0.032040 -0.074061 -0.030889 -0.062924 0.126696 0.464436 -0.322152 -0.085283 0.059079 0.021398 -0.096894
polarizability: 2.45018447e+02 -4.05815431e+00 1.73710434e+02 -9.00302479e+00 1.85343391e+01 1.58731952e+02
1716.lowfreq: -12.5026 -5.2400 -0.0022 -0.0006 0.0003 6.3150 21.0993 32.8954 41.1394
frequency: 20.3757 32.7108 40.9263 52.3886 58.4718 90.3861 103.1812 112.0470 143.5723 165.2980 168.4356 182.2433 186.3598 193.2367 225.7480 239.5934 257.6757 264.0381 283.1630 290.9257 317.7844 357.3387 366.9971 370.5510 376.3556 388.3131 422.0255 429.0965 465.8215 483.0949 518.8726 577.1298 622.0561 653.9275 675.2477 696.1904 744.6102 751.0099 775.6548 782.2678 828.2708 861.6975 870.8467 879.6955 909.7212 922.2796 937.9617 957.4180 958.6978 960.7355 964.7388 972.0566 1025.7683 1064.1192 1084.0020 1093.0754 1108.7925 1117.8785 1140.4287 1173.9117 1182.9122 1195.6829 1204.5063 1246.5708 1257.6096 1276.0136 1304.8226 1309.0174 1319.2607 1340.4908 1345.1937 1358.2235 1371.4336 1375.0234 1376.5813 1380.3892 1396.3037 1400.3164 1401.7675 1446.7839 1454.0092 1454.7347 1464.4152 1466.6322 1472.9560 1477.2666 1478.6586 1484.9644 1488.6917 1494.5785 1552.9628 1567.6401 1585.3860 2949.4029 2955.1341 2965.5736 2971.5980 2978.8951 2980.9030 3015.4689 3022.2112 3058.4945 3063.4260 3064.4948 3068.4158 3071.5927 3073.9505 3078.4242 3083.0151 3089.9165 3095.1185 3138.0596 3176.7043 3182.9922
redmass: 3.5977 4.1333 2.8372 6.0692 4.9252 3.1474 4.7529 3.5150 3.8171 5.4537 5.7424 1.3138 3.5261 5.7555 1.1793 3.4440 1.1256 4.7418 1.7167 1.8582 2.7766 3.3372 2.1545 3.0642 2.5429 5.1736 3.1391 1.7729 3.6269 7.5226 4.2041 3.7066 3.3847 5.7114 4.0279 6.4478 4.4121 5.0964 3.6473 3.9971 1.4508 2.2371 1.4000 1.5756 1.3038 1.2165 1.5793 1.4451 1.8194 1.5883 1.7605 2.2497 3.7109 1.7795 2.5687 1.9420 1.9930 1.8405 1.3813 2.4329 2.0986 2.1080 2.3264 1.3939 1.5399 1.3525 1.4698 1.4510 1.6706 1.5727 3.4929 1.2313 1.7010 1.2289 2.4503 1.2398 1.2417 1.2212 1.9396 1.1188 2.1625 1.1043 1.1510 1.0543 1.0615 1.0560 1.0544 1.0562 1.0568 1.0582 7.3872 7.3934 7.4135 1.0822 1.0826 1.0356 1.0357 1.0365 1.0361 1.0607 1.0606 1.0995 1.0994 1.0996 1.0985 1.1000 1.0993 1.1016 1.0991 1.1025 1.0995 1.0898 1.0955 1.0936
irintensity: 0.0383 0.2141 0.1446 0.8998 0.3722 0.7389 0.2340 0.3649 2.0415 1.0295 0.1827 0.6914 0.6987 1.0738 0.4259 0.2529 0.2696 5.4113 2.8428 0.4572 0.4509 1.0465 0.0056 0.1905 0.7785 12.6531 5.1559 5.1765 1.3985 27.3333 2.1948 12.8978 1.4638 3.5693 8.0706 8.3191 6.8097 27.2792 11.6050 27.6088 37.3036 10.6823 18.3125 8.6979 12.1043 1.1185 13.8637 3.3965 5.1754 0.9405 9.9170 9.9430 51.8542 34.5874 49.8948 22.1635 26.1731 3.3274 3.6068 3.1311 4.8724 2.7023 9.5383 34.3076 73.5156 14.1010 10.5897 7.9879 20.1852 3.2354 11.2906 2.5352 9.9279 11.2911 12.9267 8.0721 16.4251 12.1997 120.0202 28.8203 40.4841 11.3602 6.2842 0.7879 5.2931 25.3282 7.5683 20.3610 27.7015 15.0999 90.6638 148.5124 84.9067 27.0522 27.9496 26.5449 32.1143 25.8796 15.1272 33.8112 28.0862 28.6417 19.7196 23.4677 144.4203 22.4684 62.1789 19.8519 40.0207 11.1978 19.3592 6.0795 1.0736 0.8401
temp: 298.150 k
press: 1.00000 atm
elementType: 17 17 8 7 6 6 6 6 6 6 6 6 6 6 6 6 6 6 6 1 1 1 1 1 1 1 1 1 1 1 1 1 1 1 1 1 1 1 1 1
symmnumber: 1
zpe: 859713.1 jmol-1
zpe.correction: 0.327447 hartree
zpe.thermalcorrener: 0.348709 hartree
zpe.thermalcorrenthalpy: 0.349653 hartree
zpe.thermalcorrgfe: 0.275958 hartree
zpe.sumelectzpe: -1632.836265 hartree
zpe.sumelectthermal: -1632.815004 hartree
zpe.sumelectthermalent: -1632.814060 hartree
zpe.sumelectthermalfe: -1632.887755 hartree
dipole: -2.6266 -0.1915 -4.2360
dipole: 4.9879
quadrupole: -125.8618 -125.4631 -136.6840
quadrupole: 1.3625 3.8552 1.2161
quadrupole: 3.4745 3.8732 -7.3477 1.3625 3.8552 1.2161
hfenergy: -1633.1637129 hartree
pointgroup: C01 [X(C15H21Cl2N1O1)]
dipole: 1.0551925 -0.0277264 1.6543268 debye
polarizability: 244.6172337|-4.6806282|170.3156907|-12.2455857|-18.4824848|162.5279086 unknown
InChI: InChI=1S/C15H21Cl2NO/c1-10(2)8-18(9-11(3)4)15(19)13-6-5-12(16)7-14(13)17/h5-7,10-11H,8-9H2,1-4H3
charge 0 multiplicity 1
40 atoms
Cl -1.623461 1.98456 -2.177776
Cl -5.451902 -0.315256 1.071028
O  0.521926 -0.460985 -2.166688
N  1.450615 -0.091669 -0.052865
C  2.786643 -0.491967 -0.580904
C  1.380397 0.517816 1.302715
C  3.161349 -1.988635 -0.363375
C  1.653079 2.052719 1.40637
C  2.19124 -2.962731 -1.0707
C  3.324523 -2.362776 1.129708
C  0.597119 2.894818 0.657739
C  3.081857 2.476353 0.991348
C  0.372612 -0.188152 -0.933047
C  -1.032592 -0.094865 -0.366701
C  -2.029202 0.755666 -0.901037
C  -1.442421 -1.038096 0.61472
C  -3.370607 0.710001 -0.470041
C  -2.77728 -1.122706 1.060645
C  -3.722608 -0.236306 0.510195
H  3.548976 0.140408 -0.097093
H  2.788437 -0.277302 -1.664415
H  2.108731 -0.013137 1.941824
H  0.377583 0.330886 1.72293
H  4.157958 -2.09364 -0.845723
H  1.548554 2.264254 2.493709
H  2.55967 -4.002204 -0.985586
H  2.072808 -2.712006 -2.138274
H  1.185754 -2.925138 -0.611089
H  2.354017 -2.319575 1.659973
H  4.034049 -1.689737 1.648428
H  3.706192 -3.395749 1.228509
H  0.770932 3.972963 0.830157
H  -0.428868 2.65894 0.99489
H  0.644151 2.72118 -0.43243
H  3.230577 2.373557 -0.099065
H  3.857554 1.880712 1.509381
H  3.249456 3.539149 1.246141
H  -0.698808 -1.734403 1.018139
H  -4.114697 1.388991 -0.892949
H  -3.073919 -1.861338 1.809812
