program: Gaussian 09
title: 000221455
version: EM64L-G09RevD.01
frameworkgroup: C1[X(C13H24O2)]
method: RPBEPBE
basis: SDD
operation: Freq
keyword: #pfreq=noraman
keyword: PBEPBE/SDD
title: #p freq=noraman PBEPBE/SDD
converged: YES YES NO NO
title: Mulliken charges:
elementType: O O C C C C C C C C C C C C C H H H H H H H H H H H H H H H H H H H H H H H H
charge: -0.289835 -0.251647 -0.022933 -0.059129 -0.495599 0.012638 -0.492080 -0.437946 -0.049852 -0.750044 -0.738885 -0.750137 0.285157 -0.496966 -0.662991 0.197737 0.245098 0.211701 0.208793 0.205306 0.226470 0.205065 0.200119 0.185908 0.223790 0.219172 0.214934 0.209153 0.209451 0.214104 0.213812 0.215195 0.212345 0.231450 0.239258 0.238729 0.235122 0.213894 0.223643
chargesum: 0.00000
title: Mulliken charges with hydrogens summed into heavy atoms:
elementType: O O C C C C C C C C C C C C C
charge: -0.289835 -0.251647 0.174804 0.185969 -0.075105 0.217943 -0.060545 -0.051920 0.173939 -0.106785 -0.101518 -0.091147 0.285157 -0.018978 0.009668
polarizability: 1.64297527e+02 1.86424648e+00 1.47223612e+02 1.17501603e+00 -2.64553612e+00 1.22454060e+02
1716.lowfreq: -18.5562 -11.5214 -0.0004 0.0003 0.0006 5.8240 23.4891 35.3976 48.9325
frequency: 22.2528 35.2916 48.8842 56.5879 63.2634 87.9813 155.3887 161.1225 185.3307 200.0565 208.4572 215.9980 233.1487 249.1853 252.5693 267.9235 279.0795 307.6531 376.6449 392.1343 420.4478 443.4280 466.2894 493.6722 544.5720 552.5958 585.9940 639.1327 765.9201 792.4301 799.2098 826.5874 846.4941 877.2465 897.5008 916.1869 919.1432 940.1387 954.7780 967.9025 979.0438 1005.5554 1015.6804 1042.1653 1062.2760 1079.1155 1080.3965 1084.2699 1102.3926 1109.9064 1136.8572 1154.7411 1164.4412 1184.4287 1193.8266 1233.8279 1238.6138 1243.6815 1263.3057 1276.8418 1288.7648 1306.7753 1314.6330 1323.4185 1332.9969 1333.8351 1342.4934 1349.1419 1352.4444 1361.8559 1381.1090 1387.3348 1398.3337 1399.8724 1444.5374 1459.1514 1465.3831 1467.6513 1469.3943 1471.2384 1474.9622 1477.0073 1477.7241 1481.7217 1488.3858 1489.1163 1636.3362 2945.9154 2948.5197 2960.8109 2967.6516 2969.2786 2974.3080 2977.4624 2978.3555 2984.2874 2993.0355 2998.3228 3019.4040 3024.7146 3041.3793 3048.2752 3048.5711 3062.8077 3063.1187 3064.0132 3068.3380 3068.4692 3071.3675 3093.9807 3103.1451
redmass: 2.4187 4.3504 2.8060 2.4061 2.8077 2.9018 3.4837 2.8070 1.2107 1.1579 1.4158 1.4881 1.0757 3.5620 2.7029 2.8135 2.7179 3.6677 2.6920 2.6570 1.9896 2.7801 3.0220 2.8844 2.9226 3.3823 2.4711 4.1334 2.3200 1.3606 2.0861 2.8480 2.8821 1.8478 2.4474 1.4741 1.4002 1.9150 1.4158 1.6108 1.9648 1.9083 1.8306 1.8567 1.5313 2.3118 1.5275 1.7247 2.4148 2.3517 3.2073 2.5361 2.1064 2.0662 2.0018 1.3163 1.4614 1.1790 1.2304 1.3654 1.2519 1.2562 1.3222 1.3101 1.4147 1.4767 1.6164 1.6308 1.5219 1.5823 1.2083 1.2174 1.2124 1.2113 1.0858 1.0868 1.0732 1.0622 1.0782 1.0400 1.0496 1.0561 1.0594 1.0515 1.0553 1.0453 9.3670 1.0806 1.0813 1.0630 1.0373 1.0353 1.0434 1.0573 1.0590 1.0835 1.0606 1.0386 1.0842 1.0978 1.1012 1.0999 1.0975 1.0994 1.0993 1.0993 1.0993 1.0985 1.0985 1.1004 1.1001
irintensity: 0.3444 0.5449 1.3557 0.8901 0.7632 0.9616 0.5321 1.5746 0.3753 0.0453 0.2001 0.1221 0.1314 3.3397 3.7766 0.9362 0.3974 9.0971 1.1356 0.1231 1.4747 4.1863 0.5167 2.6171 2.3215 1.6936 2.9464 0.9942 0.0719 13.0663 1.0137 13.9704 4.6890 4.1679 20.1312 1.5253 4.1035 41.9365 2.8686 3.1081 13.9404 5.8075 51.8054 8.2801 18.7237 56.6417 24.0578 0.7870 16.6574 1.6073 343.2215 8.8719 1.5373 0.9264 10.5974 1.2617 0.3009 1.6422 1.7478 1.8824 7.1726 0.1678 9.3120 13.4515 1.5169 15.3023 21.8759 4.6005 3.8074 2.2272 20.9707 10.7108 20.2687 19.7795 25.4763 1.3092 10.5275 3.3899 3.2993 12.8959 18.0622 5.9546 5.6690 14.6462 15.0448 10.8559 150.2297 16.2447 5.1017 35.8760 41.7932 37.4435 1.1843 82.1438 2.3109 11.5756 22.4352 22.7082 27.8791 46.0388 34.2576 13.3695 14.3219 20.6557 26.3569 58.5196 32.2700 73.3418 85.0634 33.0203 30.3228
temp: 298.150 k
press: 1.00000 atm
elementType: 8 8 6 6 6 6 6 6 6 6 6 6 6 6 6 1 1 1 1 1 1 1 1 1 1 1 1 1 1 1 1 1 1 1 1 1 1 1 1
symmnumber: 1
zpe: 907673.4 jmol-1
zpe.correction: 0.345715 hartree
zpe.thermalcorrener: 0.363590 hartree
zpe.thermalcorrenthalpy: 0.364535 hartree
zpe.thermalcorrgfe: 0.298840 hartree
zpe.sumelectzpe: -659.027891 hartree
zpe.sumelectthermal: -659.010015 hartree
zpe.sumelectthermalent: -659.009071 hartree
zpe.sumelectthermalfe: -659.074765 hartree
dipole: -0.9376 0.6291 -1.5383
dipole: 1.9082
quadrupole: -89.6066 -94.1159 -97.0891
quadrupole: 2.5943 -6.0054 2.6548
quadrupole: 3.9973 -0.5121 -3.4852 2.5943 -6.0054 2.6548
hfenergy: -659.3736052 hartree
pointgroup: C01 [X(C13H24O2)]
dipole: -0.4285585 -0.0883747 0.6100143 debye
polarizability: 160.9263832|-7.0890394|150.4648047|-2.1175053|-2.6364147|122.5840111 unknown
InChI: InChI=1S/C13H24O2/c1-5-13(14)15-12-8-10(4)6-7-11(12)9(2)3/h9-12H,5-8H2,1-4H3
charge 0 multiplicity 1
39 atoms
O  1.124517 -0.279244 0.638539
O  2.491463 0.180819 -1.199848
C  -1.31722 -0.393575 0.445948
C  -0.058197 0.343415 -0.056343
C  -2.566376 0.308955 -0.155859
C  -1.326394 2.545578 -0.316734
C  -0.072331 1.847811 0.269716
C  -2.601815 1.819064 0.177232
C  -1.26535 -1.934642 0.189953
C  -1.342633 4.047559 0.036832
C  -2.399397 -2.670343 0.944674
C  -1.27448 -2.320983 -1.309981
C  2.345218 -0.271915 -0.040042
C  3.436936 -0.872892 0.834639
C  4.729681 -1.173745 0.055181
H  -1.352064 -0.25129 1.548938
H  0.085811 0.201328 -1.144744
H  -3.482754 -0.180857 0.223226
H  -2.570307 0.18513 -1.25761
H  -1.287199 2.448155 -1.423975
H  0.846947 2.317669 -0.1276
H  -0.066356 1.974487 1.371566
H  -3.49881 2.285352 -0.27601
H  -2.68935 1.955235 1.276073
H  -0.303487 -2.280839 0.619653
H  -0.437007 4.559562 -0.33832
H  -2.223863 4.55199 -0.401963
H  -1.382728 4.19144 1.133833
H  -3.394194 -2.429382 0.524954
H  -2.268198 -3.766056 0.870939
H  -2.408323 -2.402004 2.018165
H  -2.225638 -2.035231 -1.796639
H  -1.162462 -3.415487 -1.421621
H  -0.447757 -1.84623 -1.869568
H  3.633586 -0.154064 1.655003
H  3.03202 -1.778764 1.322118
H  5.105817 -0.265805 -0.445771
H  5.511845 -1.550849 0.737527
H  4.554848 -1.932652 -0.727082
