program: Gaussian 09
title: 000221436
version: EM64L-G09RevD.01
frameworkgroup: C1[X(C10H12O2)]
method: RPBEPBE
basis: SDD
operation: Freq
keyword: #pfreq=noraman
keyword: PBEPBE/SDD
title: #p freq=noraman PBEPBE/SDD
converged: YES YES NO NO
title: Mulliken charges:
elementType: O O C C C C C C C C C C H H H H H H H H H H H H
charge: -0.307262 -0.214133 0.332832 0.253893 -0.480708 -0.380935 -0.355199 -0.813002 0.244401 -0.234586 -0.217389 -0.657304 0.244912 0.245276 0.232726 0.247898 0.230320 0.268818 0.224374 0.227913 0.230966 0.225135 0.216567 0.234486
chargesum: 0.00000
title: Mulliken charges with hydrogens summed into heavy atoms:
elementType: O O C C C C C C C C C C
charge: -0.307262 -0.214133 0.332832 0.253893 0.009480 -0.148209 -0.107301 -0.089490 0.244401 -0.006673 0.013577 0.018884
polarizability: 1.48084620e+02 -3.80246366e+00 1.12104285e+02 8.17035998e+00 1.70832673e+00 7.11786558e+01
1716.lowfreq: -15.2601 -0.0008 -0.0007 -0.0006 3.4843 10.4321 14.1657 55.2951 66.0439
frequency: -12.1477 55.2663 65.9548 87.3916 156.7996 179.8849 189.1924 231.6970 272.3187 293.3013 319.6883 424.5195 447.6641 515.3377 519.0492 552.5095 591.2327 644.4567 709.9188 732.2298 764.2171 789.8781 808.9684 844.6611 866.6997 944.4040 983.4575 986.1997 1007.9134 1040.3305 1049.8925 1065.6226 1084.3085 1093.7788 1109.4021 1162.3360 1170.1759 1223.0909 1242.4706 1280.0638 1336.0566 1378.0713 1396.7249 1399.4293 1432.0215 1441.8412 1465.2651 1471.9943 1477.5956 1481.2042 1485.9221 1588.3905 1618.5781 1669.5817 2982.0490 2997.0995 2999.8857 3046.7172 3064.1969 3091.0631 3096.5906 3103.2743 3125.5053 3139.5716 3155.5600 3171.3927
redmass: 1.9359 5.5510 3.2832 4.5835 1.3599 1.9498 1.1813 3.6182 3.8412 4.0126 4.1548 3.6804 2.9405 3.4649 4.0263 3.7648 6.4078 4.3833 3.4910 2.8035 1.6490 1.3510 4.1522 3.5848 1.4549 1.3868 1.3211 1.6138 2.0135 2.0098 1.5559 2.8060 1.6643 2.8641 2.2821 1.9776 1.0867 2.6140 1.1751 1.4787 1.7514 7.4521 1.2384 1.2123 2.2034 1.0840 1.0807 1.0416 2.1767 1.0681 1.1961 6.0496 7.2671 9.9811 1.0365 1.0549 1.0431 1.0977 1.0977 1.0994 1.1004 1.1003 1.0866 1.0895 1.0945 1.1002
irintensity: 0.2336 2.0455 1.7104 1.8814 1.9237 0.7309 0.8605 3.2216 2.8248 4.2239 8.5288 3.7636 7.3910 0.4973 1.6353 0.5783 0.6589 1.6315 5.7945 16.7310 49.0913 16.1710 25.7760 13.0415 4.0186 2.4770 0.0538 0.4549 53.3514 4.5714 5.8489 193.4810 2.0698 307.1165 82.2958 29.5947 1.5004 15.4431 0.2235 0.8260 48.7233 2.4712 16.7772 15.3665 6.2117 32.7205 19.9199 11.0228 34.8918 12.2443 37.9953 9.0576 1.0122 139.9538 21.1832 29.9175 11.4640 3.8709 10.7013 21.7210 29.2410 28.9354 4.7597 11.7468 26.1707 14.8052
temp: 298.150 k
press: 1.00000 atm
elementType: 8 8 6 6 6 6 6 6 6 6 6 6 1 1 1 1 1 1 1 1 1 1 1 1
symmnumber: 1
zpe: 509141.8 jmol-1
zpe.correction: 0.193922 hartree
zpe.thermalcorrener: 0.205271 hartree
zpe.thermalcorrenthalpy: 0.206215 hartree
zpe.thermalcorrgfe: 0.156308 hartree
zpe.sumelectzpe: -537.828273 hartree
zpe.sumelectthermal: -537.816923 hartree
zpe.sumelectthermalent: -537.815979 hartree
zpe.sumelectthermalfe: -537.865887 hartree
dipole: -0.2623 -0.2039 -1.4326
dipole: 1.4706
quadrupole: -59.4721 -63.8757 -78.2127
quadrupole: 1.7120 5.0386 -1.8181
quadrupole: 7.7148 3.3111 -11.0259 1.7120 5.0386 -1.8181
hfenergy: -538.0221945 hartree
pointgroup: C01 [X(C10H12O2)]
dipole: 0.1087977 -0.0576023 -0.5653184 debye
dipolederiv: -1.9715232 0.0603022 -0.2602152 0.1302583 -0.2707218 0.0583659 -0.3280951 0.0509434 -0.5456418 -0.6703755 -0.0197118 0.1149861 0.0523476 -0.2851678 0.0795733 -0.3854865 0.0828361 -0.8656261 -0.1047003 -0.1792855 0.0069034 -0.1936643 0.1842161 0.0176924 0.1144092 -0.0407323 -0.0219415 1.1406743 -0.0191691 -0.0093339 0.0856499 0.1010974 -0.0064202 -0.3397818 0.0033567 0.0120948 -0.2200524 -0.0176039 0.0904164 -0.0565205 0.1068349 0.0611084 0.1928885 0.0370132 -0.0651332 -0.0257001 0.1328063 -0.0614438 0.036063 0.0049167 -0.0626818 -0.0475872 -0.0777648 -0.1287103 -0.1992196 0.0275102 -0.0612999 0.0618821 -0.0213296 -0.0532816 -0.0056589 -0.0274887 -0.1096501 -0.0411066 0.1464217 -0.0206406 0.0853506 -0.0486662 0.0124568 -0.040863 0.0555339 0.0262111 1.9059005 0.0104445 0.1105096 -0.1738644 0.2009884 -0.1757913 0.7980421 -0.1398386 1.2094699 0.0671649 -0.0018983 -0.0612971 0.0206105 -0.0527949 -0.0252529 -0.061671 -0.0195766 -0.1358051 -0.0244178 -0.0569009 -0.0264564 -0.0589582 0.0481368 -0.0283499 -0.0271869 -0.0340163 -0.1531165 -0.0061409 0.018851 -0.0465288 0.0154461 0.0655966 0.0070603 -0.0004288 0.0137192 0.0242128 0.0368708 0.0265419 -0.0016261 0.0159033 -0.067818 0.0851696 -0.028573 0.0608436 0.0866067 0.0354594 -0.0223319 -0.0389575 0.0131102 0.0459531 -0.1144708 -0.0604431 -0.0809287 -0.0269763 0.0384352 -0.0533975 0.031634 -0.0867237 -0.0676334 0.0632919 0.0448106 0.0573157 0.1302068 0.0667997 -0.0754182 0.0506842 -0.0691985 -0.0117668 0.0495873 0.041265 0.0537473 0.139595 0.0214489 0.0569055 0.1050826 0.0491474 0.0517647 0.0222867 0.1159699 -0.0505163 -0.0328374 0.0360001 0.0557021 -0.0889728 0.0420385 0.0658363 -0.0262223 -0.1028225 0.0181648 -0.0022607 -0.0218975 -0.1619623 0.0145392 -0.0671621 -0.0653582 0.0064865 0.019405 0.01032 0.1155618 -0.1218758 0.0139133 0.0603339 0.0058549 0.0877974 0.014248 0.0667547 0.0129665 0.1445828 0.0168168 0.0923826 0.0045495 0.103724 -0.0620337 0.0302542 0.0087755 0.0307821 0.1535103 0.0931251 -0.0404485 -0.0017814 0.0118156 -0.120824 0.0708929 -0.037384 0.0652852 0.0658121 -0.1597041 -0.0135921 0.0836955 -0.0215227 0.1014102 0.0212831 0.1200704 0.0190881 0.0300763 0.1080181 0.0199386 0.0052191 -0.0015876 0.0095658 -0.1072864 -0.0564092 -0.1010532 -0.0502414 unknown
polarizability: 147.7413794|-7.0712395|109.6479131|-6.4739696|-10.590008|73.9782681 unknown
InChI: InChI=1S/C10H12O2/c1-3-10(11)12-9-7-5-4-6-8(9)2/h4-7H,3H2,1-2H3
charge 0 multiplicity 1
24 atoms
O  0.794784 0.302103 -0.800802
O  1.632451 -0.076653 1.360275
C  -1.189227 -0.934246 0.035797
C  -0.579881 0.278455 -0.373893
C  3.176474 0.227875 -0.557058
C  -2.57106 -0.876738 0.351909
C  -1.291387 1.488417 -0.482554
C  -0.411188 -2.230653 0.127971
C  1.834259 0.122686 0.147971
C  -3.305451 0.326937 0.261154
C  -2.665836 1.514786 -0.161018
C  4.361816 -0.123622 0.358964
H  3.267185 1.261718 -0.94447
H  3.145269 -0.420756 -1.452444
H  -3.07427 -1.797121 0.671202
H  -0.765492 2.387939 -0.817385
H  0.236689 -2.376364 -0.755829
H  0.243681 -2.228727 1.018858
H  -1.093051 -3.094226 0.202899
H  -4.371611 0.335719 0.512432
H  -3.227676 2.451418 -0.240189
H  4.294769 -1.16621 0.714662
H  5.314521 -0.001777 -0.185557
H  4.380432 0.527838 1.249003
