program: Gaussian 09
title: 000221518
version: EM64L-G09RevD.01
frameworkgroup: C1[X(C21H16Br2O5S)]
method: RPBEPBE
basis: SDD
operation: Freq
keyword: #p
keyword: freq=noraman
keyword: PBEPBE/SDD
title: #p freq=noraman PBEPBE/SDD
converged: YES YES NO NO
title: Mulliken charges:
elementType: Br Br S O O O O O C C C C C C C C C C C C C C C C C C C C C H H H H H H H H H H H H H H H H
charge: 0.019747 0.042547 0.954497 -0.555966 -0.393808 -0.481440 -0.498315 -0.189883 0.139211 0.321603 0.314639 0.341759 -0.275026 -0.555667 -0.546408 -0.362788 -0.336428 0.397555 -0.256240 0.338653 -0.227519 0.252824 -0.455255 -0.222361 -0.426256 0.127507 -0.235354 -0.785825 -0.787059 0.249523 0.271953 0.282407 0.304325 0.267701 0.298115 0.248363 0.252627 0.247113 0.219356 0.244002 0.213371 0.251953 0.248207 0.384160 0.357878
chargesum: 0.00000
title: Mulliken charges with hydrogens summed into heavy atoms:
elementType: Br Br S O O O O O C C C C C C C C C C C C C C C C C C C C C
charge: 0.019747 0.042547 0.954497 -0.171806 -0.035930 -0.481440 -0.498315 -0.189883 0.139211 0.321603 0.314639 0.341759 -0.275026 -0.306143 -0.274455 -0.080381 -0.032103 0.397555 0.011462 0.338653 0.070596 0.252824 -0.455255 0.026002 -0.426256 0.127507 0.017273 -0.075354 -0.073527
polarizability: 4.98604457e+02 4.15102136e+01 3.81437505e+02 7.63288797e+00 2.71602891e+01 2.21951302e+02
1716.lowfreq: -6.8949 -2.8481 -0.4396 -0.0017 -0.0010 -0.0009 19.8805 22.6075 27.4021
frequency: 19.7329 22.5911 27.3826 37.1170 40.3512 45.8968 58.8651 82.0089 99.9318 104.2571 115.9373 116.7359 123.7403 127.0277 133.5450 148.7302 164.3228 177.7541 182.7188 198.4054 202.8351 211.7755 226.9798 245.6744 252.3619 265.6259 284.9055 293.5750 294.7380 311.4445 327.5323 331.5021 344.9932 353.9910 395.0287 422.4903 447.3314 460.8865 470.8598 478.9869 483.6655 498.4661 499.3380 540.5411 548.0681 553.2992 570.9496 587.1408 618.8285 630.4527 656.6987 690.2666 702.3959 726.9008 740.4977 775.4700 785.4342 788.1464 797.7684 825.3573 833.0124 861.8999 884.1090 893.7252 896.5535 904.6268 922.4080 949.3090 961.0653 973.5344 981.6168 991.5355 1004.6685 1007.5406 1025.4133 1045.8047 1049.5055 1049.9086 1054.8691 1096.8212 1100.9508 1120.2781 1174.8695 1177.5761 1213.5731 1224.6515 1240.6489 1259.5252 1282.7250 1305.1014 1316.9061 1343.0643 1357.0026 1371.6351 1384.6293 1399.5292 1401.4014 1413.6842 1419.5276 1444.9052 1450.4596 1456.9608 1458.6583 1461.2057 1480.5329 1492.0330 1541.2137 1553.4094 1555.8511 1561.0743 1596.6132 1604.1664 1630.2412 2986.7086 2989.2809 3066.3851 3069.3396 3097.1499 3100.1121 3140.7398 3142.9739 3143.3465 3153.1165 3158.2965 3161.8428 3177.6142 3184.2322 3465.9454 3474.0856
redmass: 10.3603 9.9302 11.4236 6.5477 8.4039 7.5738 8.3886 5.9777 5.3518 4.2274 5.0774 1.6976 2.4675 1.1031 6.3587 1.4312 5.6162 5.2050 5.2069 5.5504 4.9144 8.7781 3.4966 4.3383 8.2828 6.2954 4.5910 4.4541 5.3448 6.1848 7.2214 6.8341 6.6720 5.9771 6.8508 10.2155 4.5587 3.6676 5.1144 1.9504 3.1974 4.7370 1.9617 5.4946 7.9496 4.8044 5.4862 4.5668 5.2890 5.8516 7.0976 5.5193 7.1941 4.1538 4.3340 1.3161 5.7533 6.7162 6.2732 4.8120 12.9248 5.6308 1.4167 1.3995 1.4417 1.4495 1.3763 3.0892 9.9933 1.4915 2.9489 3.1310 1.4076 2.1495 2.0568 1.8652 1.5308 1.5394 1.2442 2.4084 2.7045 1.8071 1.8426 1.0930 1.9821 2.5315 1.9329 1.5595 2.0979 1.8446 2.0226 2.8631 4.5120 3.8636 4.5063 1.3016 1.3240 2.9798 2.3864 1.0458 2.5775 1.0503 2.1235 1.2406 1.5867 5.7986 8.8869 5.7410 7.0675 6.2299 6.9853 6.3610 6.5719 1.0363 1.0366 1.0960 1.0970 1.1011 1.1005 1.0910 1.0895 1.0889 1.0897 1.0921 1.0949 1.1008 1.0932 1.0647 1.0661
irintensity: 0.8533 0.0962 0.0748 0.1620 0.8096 0.6769 0.8277 4.4552 1.7249 0.3280 1.4073 1.2155 0.9800 0.1222 1.6116 65.9075 2.0088 0.6155 5.0802 2.4953 5.6239 1.5030 5.2047 0.8048 10.4570 18.6079 21.2524 22.0081 8.0984 1.1266 4.1060 1.2325 5.9480 1.7089 13.4106 45.0028 33.2129 0.7707 3.6716 47.0066 12.7075 11.1018 50.0287 8.5626 134.7373 3.0317 8.8960 0.9180 59.7547 9.3683 23.1365 2.2906 15.0348 9.2312 9.4057 37.8680 10.1168 51.0103 9.6197 79.0050 57.4524 18.8178 5.1665 5.0572 20.2474 5.3745 10.2296 2.4886 116.0255 8.0899 4.5952 1.2148 1.3460 9.0006 77.8040 9.2461 3.1907 9.4880 43.2648 129.1373 33.6008 6.9455 40.9341 4.9258 71.2128 4.8668 51.8628 25.0807 98.5402 17.5102 217.8673 64.2972 12.5640 6.6049 19.9723 37.3725 15.0291 3.6550 10.4804 10.4002 103.2564 10.7924 27.3607 10.9551 124.6748 207.5391 106.6311 0.7580 20.8922 20.3458 3.3252 84.5455 4.5254 16.7838 24.6134 8.9214 10.9384 8.8520 11.7055 8.9881 7.5206 1.2886 8.2826 1.9598 0.2472 14.6265 1.0557 110.8833 46.7490
temp: 298.150 k
press: 1.00000 atm
elementType: 35 35 16 8 8 8 8 8 6 6 6 6 6 6 6 6 6 6 6 6 6 6 6 6 6 6 6 6 6 1 1 1 1 1 1 1 1 1 1 1 1 1 1 1 1
symmnumber: 1
zpe: 821618.9 jmol-1
zpe.correction: 0.312938 hartree
zpe.thermalcorrener: 0.342408 hartree
zpe.thermalcorrenthalpy: 0.343352 hartree
zpe.thermalcorrgfe: 0.249751 hartree
zpe.sumelectzpe: -1608.688172 hartree
zpe.sumelectthermal: -1608.658702 hartree
zpe.sumelectthermalent: -1608.657758 hartree
zpe.sumelectthermalfe: -1608.751359 hartree
dipole: 5.8517 4.3001 4.9965
dipole: 8.8147
quadrupole: -210.0735 -182.7491 -196.3639
quadrupole: -24.7603 -7.9021 13.4277
quadrupole: -13.6780 13.6464 0.0316 -24.7603 -7.9021 13.4277
hfenergy: -1609.0011101 hartree
pointgroup: C01 [X(C21H16Br2O5S1)]
dipole: 2.4489543 1.2329431 2.1234879 debye
polarizability: 490.0124479|58.2718059|359.5749718|-13.8156012|63.6922975|252.4058444 unknown
InChI: InChI=1S/C21H16Br2O5S/c1-11-7-13(9-16(22)20(11)24)19(14-8-12(2)21(25)17(23)10-14)15-5-3-4-6-18(15)29(26,27)28/h3-10,24,26H,1-2H3
charge 0 multiplicity 1
45 atoms
Br 3.735578 -2.065596 -2.71816
Br -5.50432 -1.046944 -0.378395
S  0.32473 2.66808 -1.383871
O  2.124642 2.649173 -0.911195
O  5.344494 -0.919122 -0.245653
O  -0.018523 1.375278 -2.289087
O  -0.008425 4.146471 -1.952975
O  -4.230884 -3.896008 -0.707365
C  -0.270039 -0.064492 0.382707
C  -0.658134 1.265174 0.953298
C  1.176458 -0.309274 0.203147
C  -1.259604 -1.030137 0.115108
C  -0.374709 2.52519 0.37052
C  2.119242 0.1583 1.164267
C  -0.936521 -2.437882 -0.095409
C  -1.319027 1.312991 2.215597
C  1.661384 -0.977994 -0.957564
C  3.503035 -0.049798 1.030151
C  -2.667879 -0.651775 0.044977
C  -1.894016 -3.394546 -0.357635
C  -0.68397 3.76184 0.958595
C  3.970608 -0.734785 -0.129441
C  3.037602 -1.177834 -1.102997
C  -1.638337 2.536479 2.841527
C  -3.636268 -1.585376 -0.234435
C  -3.335212 -3.022737 -0.459364
C  -1.3178 3.764752 2.221076
C  4.5030 0.432384 2.057761
C  -1.567283 -4.857803 -0.531896
H  1.758317 0.691337 2.050474
H  0.107031 -2.749898 0.016679
H  -1.558831 0.363512 2.7055
H  0.967241 -1.264842 -1.75039
H  -2.941371 0.400078 0.167447
H  -0.463655 4.691396 0.42406
H  -2.141023 2.528787 3.81408
H  -1.566119 4.715542 2.702392
H  5.220408 1.141721 1.60668
H  3.994588 0.934435 2.897366
H  5.102383 -0.406175 2.456045
H  -0.484331 -5.044521 -0.437385
H  -1.910047 -5.214793 -1.520309
H  -2.107493 -5.47112 0.212256
H  2.648346 2.829246 -1.746019
H  5.560035 -1.40171 -1.08967
