program: Gaussian 09
title: 000221428
version: EM64L-G09RevD.01
frameworkgroup: C1[X(C10H12O2S)]
method: RPBEPBE
basis: SDD
operation: Freq
keyword: #p
keyword: freq=noraman
keyword: PBEPBE/SDD
title: #p freq=noraman PBEPBE/SDD
converged: YES YES NO NO
title: Mulliken charges:
elementType: S O O C C C C C C C C C C H H H H H H H H H H H H
charge: 0.164703 -0.411769 -0.235648 -0.798533 0.486142 -0.638339 -0.447932 -0.375359 -0.379360 -0.220501 -0.220275 -0.237032 0.195064 0.264061 0.263421 0.263329 0.264279 0.265535 0.265715 0.235774 0.235294 0.226836 0.226843 0.229391 0.378362
chargesum: 0.00000
title: Mulliken charges with hydrogens summed into heavy atoms:
elementType: S O O C C C C C C C C C C
charge: 0.164703 -0.033407 -0.235648 -0.271051 0.486142 -0.110731 0.083318 -0.139585 -0.144066 0.006335 0.006568 -0.007642 0.195064
polarizability: 2.00303397e+02 -1.25619408e-01 1.06541656e+02 -1.05112006e+01 -2.02989379e-02 9.08835789e+01
1716.lowfreq: -15.4787 -3.1994 -0.9261 0.0014 0.0020 0.0021 14.2210 20.0848 34.8002
frequency: 12.9526 19.6358 33.6963 42.9669 59.7099 87.1522 102.7904 188.6183 209.0383 286.6119 323.5743 401.2742 436.3555 476.8214 507.1401 553.1190 568.9359 616.7613 636.6233 655.9399 700.9355 721.0164 777.3766 779.0835 806.9960 850.2249 872.0564 891.1512 924.8249 975.3368 981.2342 989.8838 995.9450 1025.5877 1034.2483 1070.9276 1089.7572 1125.0483 1140.2336 1172.7648 1186.5918 1214.2615 1223.7098 1244.9583 1267.0764 1282.0999 1324.1323 1362.7218 1385.4779 1440.4216 1442.9689 1457.4944 1463.9698 1483.2343 1593.9486 1614.0945 1666.7847 3002.2393 3013.7747 3026.0709 3051.1313 3084.8801 3099.7768 3121.5945 3123.8230 3136.7520 3148.1285 3164.9610 3514.2024
redmass: 5.9480 6.2573 4.7519 6.5305 2.0355 3.5803 6.5589 5.8553 6.4263 7.4936 2.3050 2.7944 4.6827 3.7300 1.7789 5.4180 5.4698 6.3340 1.3457 4.7451 1.7018 5.4765 2.2172 1.2756 4.0051 1.2503 4.1130 1.4864 1.4666 1.3951 1.5283 5.8628 1.3364 2.2015 3.2113 1.4910 2.4656 1.1025 1.1978 1.0522 1.1123 1.1953 2.5104 1.4726 1.1367 1.4925 1.2792 1.9149 8.7102 2.1970 1.0840 1.1043 1.1043 2.3759 6.1009 6.1829 8.2565 1.0609 1.0567 1.0565 1.0993 1.1088 1.1084 1.0850 1.0880 1.0920 1.0964 1.1017 1.0640
irintensity: 0.3793 1.1375 0.6773 0.3144 0.1182 2.3935 3.2136 0.4513 2.4786 0.3121 0.6844 0.0028 24.2507 3.4929 33.3907 2.6480 41.3969 0.1043 129.7774 38.3744 62.6851 6.1929 26.4531 15.2020 5.7859 0.0281 1.5976 1.3854 2.4798 0.0002 0.6537 0.2140 0.0835 14.8818 270.8227 8.1482 46.7507 3.0247 0.1307 0.0432 0.6110 2.3644 1.9647 7.0914 0.1468 24.4378 0.1607 120.1242 0.1430 8.0186 36.8879 2.1226 6.5056 14.4576 1.0509 2.3326 208.4822 15.2070 30.5145 13.8902 0.8712 15.8081 14.2463 5.9618 1.3109 15.1579 42.2448 22.4868 24.3123
temp: 298.150 k
press: 1.00000 atm
elementType: 16 8 8 6 6 6 6 6 6 6 6 6 6 1 1 1 1 1 1 1 1 1 1 1 1
symmnumber: 1
zpe: 516102.7 jmol-1
zpe.correction: 0.196573 hartree
zpe.thermalcorrener: 0.210215 hartree
zpe.thermalcorrenthalpy: 0.211159 hartree
zpe.thermalcorrgfe: 0.151269 hartree
zpe.sumelectzpe: -935.809182 hartree
zpe.sumelectthermal: -935.795541 hartree
zpe.sumelectthermalent: -935.794597 hartree
zpe.sumelectthermalfe: -935.854487 hartree
dipole: 0.0674 -0.0193 0.0744
dipole: 0.1022
quadrupole: -70.3830 -78.4331 -92.1798
quadrupole: 0.0235 3.4963 -0.1478
quadrupole: 9.9490 1.8988 -11.8478 0.0235 3.4963 -0.1478
hfenergy: -936.0057556 hartree
pointgroup: C01 [X(C10H12O2S1)]
dipole: -0.026404 -0.0092503 -0.0288858 debye
dipolederiv: -0.4094089 -0.0032725 -0.048046 -0.0034309 -0.1854665 0.0085248 -0.073839 0.007275 -0.0469429 -1.1086681 -0.0274506 -0.5558344 -0.0268128 -0.4297574 -0.013364 -0.5299494 -0.0125389 -0.6528848 -0.7785077 0.0046615 0.1616721 -0.005782 -0.3048698 -0.0272295 -0.0741706 -0.0290957 -0.9520674 0.3512724 0.0083659 0.1328723 0.0116999 0.1452001 0.0060061 0.2150782 0.0074202 0.2034689 0.2281067 -0.0027276 -0.0240072 -0.0121203 -0.0174025 -0.0051137 -0.1297401 -0.0052617 -0.078006 0.3142351 -0.0035138 -0.1010524 -0.01345 0.1606135 -0.0082561 -0.2859095 -0.0080343 0.0297002 -0.368651 0.0011717 0.068115 0.0233944 0.1294252 -0.0108625 0.5049558 -0.0089171 -0.1016825 -0.0872708 0.0752915 -0.0416093 0.0483383 0.0394574 -0.0315229 -0.0076286 -0.0248214 -0.1374932 -0.0920809 -0.0773673 -0.0325156 -0.0428481 0.0495563 0.0105784 -0.0046702 0.0030596 -0.1418728 -0.0450137 -0.0873575 -0.0357758 -0.1063632 0.0877862 0.0094373 -0.0245732 0.0189069 -0.1309789 -0.0402489 0.0861721 -0.0468756 0.1072589 0.0755071 -0.0333442 -0.0360436 -0.0418437 -0.1247012 0.0410858 -0.0070996 -0.0871724 -0.006233 -0.0594896 -0.0035342 -0.0704031 -0.0035742 -0.1371231 1.6471619 0.0153681 0.1891465 0.0168564 0.2026805 0.0537131 0.2422801 0.0539575 1.3915535 -0.0330575 0.0160956 -0.0068395 0.0382062 -0.0527993 -0.110031 -0.0595219 -0.0674661 -0.0258089 -0.0353994 -0.0190672 0.0002175 -0.046432 -0.025188 0.1096063 -0.0502386 0.0660246 -0.050937 -0.0235837 0.0027887 0.025688 0.0182509 -0.0471491 -0.0891723 0.0429283 -0.0913112 -0.0065511 -0.0231915 -0.0001717 0.0248154 -0.0132374 -0.0269239 0.0911379 0.0431496 0.0938427 -0.025874 0.1095001 0.0009033 0.0174819 -0.0236277 -0.0008382 -0.0832137 -0.0495028 -0.0725926 0.0631515 0.1089261 0.0019633 0.0157029 0.0193495 0.0157106 0.088331 -0.0534042 0.0769785 0.0470065 0.0489406 -0.0975934 0.0489841 -0.0896949 -0.0382229 0.0327695 0.0391205 0.0399567 0.1239044 0.0536572 0.1009853 0.0365235 0.0905434 -0.0507763 -0.0133465 0.0273301 -0.0208213 0.1308357 0.0286979 0.0853198 0.0306027 0.1061465 -0.0794939 -0.0147209 0.0384125 -0.0144277 0.1476897 0.0229304 -0.0845322 0.041567 -0.1038422 -0.0677632 0.0398004 0.0520953 0.0393711 0.1413283 -0.1164147 0.0077503 0.0835561 0.0081463 0.0875101 0.0015372 0.0879898 0.0014169 0.1336297 0.2069828 0.0033162 0.1027831 0.0056837 0.3926936 -0.0077303 0.156255 -0.0075038 0.2006555 unknown
polarizability: 200.3667615|-0.3563361|106.4936193|-10.1701493|-0.8707211|90.8682512 unknown
InChI: InChI=1S/C10H12O2S/c11-10(12)6-7-13-8-9-4-2-1-3-5-9/h1-5,11H,6-8H2
charge 0 multiplicity 1
25 atoms
S  0.533864 0.018967 0.626761
O  5.708455 0.061364 0.97004
O  4.911851 -0.038196 -1.209346
C  -0.643193 -0.089371 -0.883269
C  -2.080036 -0.041222 -0.423068
C  2.172242 -0.02199 -0.322425
C  3.321377 0.036594 0.692773
C  -2.747754 1.201615 -0.270341
C  -2.784099 -1.236517 -0.124805
C  -4.090447 1.249468 0.165234
C  -4.12715 -1.191703 0.310676
C  -4.784808 0.051984 0.456443
C  4.679663 0.013392 0.017926
H  -0.409615 -1.034096 -1.402812
H  -0.394761 0.761196 -1.540632
H  2.217772 -0.950324 -0.916105
H  2.209043 0.839376 -1.010091
H  3.259108 0.951488 1.312955
H  3.271491 -0.812569 1.400997
H  -2.210177 2.131662 -0.491064
H  -2.275375 -2.202083 -0.232478
H  -4.594178 2.21624 0.27619
H  -4.659546 -2.122863 0.534807
H  -5.827028 0.087494 0.792891
H  6.588702 0.046596 0.504739
