program: Gaussian 09
title: 000018819
version: EM64L-G09RevD.01
frameworkgroup: C1[X(C11H22O4Si)]
method: RPBEPBE
basis: SDD
operation: Freq
keyword: #p
keyword: freq=noraman
keyword: PBEPBE/SDD
title: #p freq=noraman PBEPBE/SDD
converged: YES YES NO NO
title: Mulliken charges:
elementType: Si O O O O C C C C C C C C C C C H H H H H H H H H H H H H H H H H H H H H H
charge: 1.547848 -0.315835 -0.591766 -0.576006 -0.576245 -0.107438 -0.076517 0.016406 -0.461150 -0.450946 -0.468999 -0.368060 -0.976227 -0.476499 -0.490707 -0.491633 0.218695 0.217592 0.226450 0.231368 0.191507 0.204895 0.228679 0.207189 0.207966 0.205447 0.216215 0.268745 0.260462 0.227676 0.217289 0.218331 0.237324 0.216137 0.202672 0.205741 0.216386 0.237008
chargesum: 0.00000
title: Mulliken charges with hydrogens summed into heavy atoms:
elementType: Si O O O O C C C C C C C C C C C
charge: 1.547848 -0.315835 -0.591766 -0.576006 -0.576245 0.111257 0.141075 0.242856 -0.038276 -0.017373 -0.053843 0.053602 -0.447021 0.186797 0.165427 0.167501
polarizability: 1.72071986e+02 4.13233060e+00 1.40905541e+02 -6.28405483e+00 -1.96241150e+00 1.27313553e+02
1716.lowfreq: -19.4714 -10.0634 -6.7363 -0.0012 -0.0010 0.0009 7.6640 10.3609 25.5565
frequency: -9.4978 3.1445 25.4153 45.7324 51.6896 58.9629 66.6570 74.5262 77.3132 86.6595 93.9810 115.3580 135.6537 147.1082 151.9886 195.2980 214.0456 227.2680 292.7708 309.9242 339.2158 345.4177 365.1891 392.0024 421.3008 461.3950 522.9115 570.1058 648.9763 683.9822 699.0591 714.3469 750.4042 772.5178 784.5592 810.8537 831.2594 889.0586 916.1467 948.4426 954.4249 1010.2640 1031.7201 1035.0809 1046.9801 1048.2030 1058.1876 1066.6319 1078.0106 1110.6640 1117.8826 1121.7503 1122.4518 1122.6338 1145.1293 1146.1881 1146.6899 1150.6604 1168.1866 1212.5720 1234.6215 1240.2888 1256.0884 1278.0229 1297.3372 1309.7547 1333.1490 1336.9701 1345.1920 1357.1552 1366.5586 1413.8341 1428.4141 1443.2054 1445.4895 1448.1558 1449.7865 1455.4383 1464.2785 1468.3120 1469.3935 1472.1736 1472.5843 1473.8681 1475.5096 1476.3042 2939.1157 2941.8699 2954.9510 2957.4427 2958.9387 2960.5080 2978.1830 2987.1725 2991.3416 3011.3099 3020.5009 3023.3801 3024.3929 3031.1209 3043.9008 3045.6741 3052.4986 3074.8805 3086.9933 3087.6832 3091.9082 3095.0944
redmass: 3.1518 3.4497 4.0402 3.1672 2.1922 2.2515 1.0786 1.2349 3.2481 1.3080 2.8804 2.7926 4.1295 2.9108 2.8656 2.2372 4.8004 4.3402 5.3510 2.6145 5.4117 4.0119 3.3763 5.4055 2.0365 4.0522 3.5187 5.9061 4.3559 2.7667 3.7589 7.4013 1.9640 3.1511 3.3112 2.7648 1.8454 2.1998 2.5843 1.8605 1.7736 2.3574 1.9106 1.4030 5.4972 4.6914 1.8676 4.9489 1.6570 1.7936 1.2532 1.2640 1.2731 1.6854 1.3891 1.4628 1.5303 1.4864 1.3227 1.2397 1.2268 1.3658 1.2779 1.2411 1.2744 1.2565 1.3387 1.3642 1.7791 1.4813 1.6063 2.5090 1.0913 1.1232 1.1209 1.1057 1.1101 1.1221 1.0847 1.0534 1.0577 1.0542 1.0576 1.0573 1.0518 1.0713 1.0336 1.0336 1.0644 1.0320 1.0602 1.0652 1.0764 1.0626 1.0594 1.0995 1.1020 1.1022 1.0972 1.0977 1.1037 1.1016 1.0992 1.0871 1.0991 1.0994 1.1015 1.0942
irintensity: 1.7790 0.1675 0.6410 0.5145 5.3273 6.5467 0.4243 0.2770 2.7970 1.7913 1.7530 0.5092 24.4642 7.6415 8.3179 1.2024 6.7370 5.5467 7.3742 6.7787 15.3115 13.4760 10.3778 37.7123 3.9360 4.5438 2.8127 35.8159 12.2997 15.1260 26.0026 91.3812 38.9049 42.3150 52.1083 42.6886 1.7800 28.1127 4.3403 3.5810 8.3273 22.9513 36.0922 7.9347 283.1419 346.1152 7.8885 21.3960 20.5972 3.9421 0.0938 1.3302 1.5082 5.7273 28.6120 35.3202 47.2921 0.1839 5.4862 24.8542 8.7473 17.1294 0.4046 3.3877 5.7784 6.4046 6.2966 1.9053 1.1426 0.2943 4.7976 4.3235 12.1572 1.2319 0.4322 7.5999 5.3081 7.2043 1.2755 12.0008 17.4457 4.1842 8.5440 2.0442 5.0448 7.2954 116.4322 36.6598 23.7837 81.5307 1.9063 31.3098 30.6969 34.5097 14.9273 8.6337 53.6152 77.5461 50.6996 23.5517 50.7964 39.4422 39.8484 26.1411 31.0678 42.7097 33.2112 83.3470
temp: 298.150 k
press: 1.00000 atm
elementType: 14 8 8 8 8 6 6 6 6 6 6 6 6 6 6 6 1 1 1 1 1 1 1 1 1 1 1 1 1 1 1 1 1 1 1 1 1 1
symmnumber: 1
zpe: 835625.7 jmol-1
zpe.correction: 0.318273 hartree
zpe.thermalcorrener: 0.338518 hartree
zpe.thermalcorrenthalpy: 0.339462 hartree
zpe.thermalcorrgfe: 0.264155 hartree
zpe.sumelectzpe: -1021.358651 hartree
zpe.sumelectthermal: -1021.338406 hartree
zpe.sumelectthermalent: -1021.337461 hartree
zpe.sumelectthermalfe: -1021.412769 hartree
dipole: 0.1364 -1.1809 -0.6865
dipole: 1.3727
quadrupole: -103.2917 -92.1204 -115.3155
quadrupole: -1.9201 -18.1519 2.7478
quadrupole: 0.2842 11.4555 -11.7397 -1.9201 -18.1519 2.7478
hfenergy: -1021.6769238 hartree
pointgroup: C01 [X(C11H22O4Si1)]
dipole: -0.0587494 -0.4458492 0.2990832 debye
polarizability: 171.9482482|-4.8927208|141.2125724|-6.035|1.1619672|127.1302595 unknown
InChI: InChI=1S/C11H22O4Si/c1-12-16(13-2,14-3)7-6-9-4-5-10-11(8-9)15-10/h9-11H,4-8H2,1-3H3
charge 0 multiplicity 1
38 atoms
Si 2.566893 0.002811 0.008634
O  -4.199945 0.004783 -1.613124
O  3.502463 -0.494854 -1.352053
O  2.9221 -0.935512 1.406677
O  3.01183 1.57477 0.548778
C  -3.69667 -1.110387 -0.718513
C  -4.62966 -0.077569 -0.154066
C  -1.72524 0.310862 0.092221
C  -2.212224 -1.078381 -0.394564
C  -4.112362 1.03745 0.74899
C  -2.656088 0.809774 1.226576
C  -0.250152 0.276915 0.565287
C  0.760964 -0.123391 -0.5413
C  4.96222 -0.54403 -1.414912
C  2.728468 -2.374835 1.52528
C  2.894233 2.798712 -0.234211
H  -4.108654 -2.093159 -0.990311
H  -5.691122 -0.341317 -0.051115
H  -1.806277 1.016861 -0.760932
H  -1.647752 -1.398322 -1.291474
H  -2.015992 -1.830971 0.399963
H  -4.781743 1.132543 1.62564
H  -4.184992 1.989159 0.187464
H  -2.260559 1.750849 1.655966
H  -2.648018 0.058995 2.044329
H  -0.156315 -0.417664 1.42668
H  0.015421 1.280213 0.957122
H  0.584417 -1.160072 -0.88614
H  0.625211 0.521678 -1.43232
H  5.2290 -0.81646 -2.44919
H  5.367814 -1.304668 -0.719768
H  5.41139 0.437223 -1.165789
H  2.993569 -2.645665 2.560317
H  3.381665 -2.935875 0.827221
H  1.674531 -2.670456 1.338708
H  1.855719 2.96886 -0.587023
H  3.569289 2.788983 -1.113141
H  3.183169 3.628547 0.431195
