program: Gaussian 09
title: 000221416
version: EM64L-G09RevD.01
frameworkgroup: C1[X(C15H20O4)]
method: RPBEPBE
basis: SDD
operation: Freq
keyword: #pfreq=noraman
keyword: PBEPBE/SDD
title: #p freq=noraman PBEPBE/SDD
converged: YES YES NO NO
title: Mulliken charges:
elementType: O O O O C C C C C C C C C C C C C C C H H H H H H H H H H H H H H H H H H H H
charge: -0.284891 -0.268989 -0.260830 -0.251147 -0.199023 -0.439144 -0.344007 0.585116 -0.356624 -0.501081 -0.444874 0.191502 0.158023 -0.327651 -0.697778 0.299491 -0.204292 -0.489050 -0.663909 0.246173 0.211673 0.213739 0.187611 0.214053 0.195377 0.197713 0.262224 0.251658 0.251537 0.211309 0.216565 0.211110 0.232903 0.240748 0.238824 0.241185 0.238418 0.214401 0.221937
chargesum: 0.00000
title: Mulliken charges with hydrogens summed into heavy atoms:
elementType: O O O O C C C C C C C C C C C C C C C
charge: -0.284891 -0.268989 -0.260830 -0.251147 0.047150 -0.013732 0.057657 0.585116 0.036466 -0.238857 -0.193216 0.191502 0.158023 -0.076114 -0.058794 0.299491 0.269359 -0.009041 0.010847
polarizability: 2.23056922e+02 -5.77907265e+00 1.49997858e+02 -4.84171692e+00 1.06182952e+01 1.53499568e+02
1716.lowfreq: -11.0797 -5.5996 -0.0006 0.0008 0.0008 3.0694 14.7887 26.5393 38.7202
frequency: 14.5100 26.4573 38.7146 46.6762 47.9393 53.2808 57.0362 71.8249 112.6611 138.0766 152.7849 171.2476 182.5336 206.9339 227.6827 235.1971 241.3537 274.9379 286.4861 341.8986 386.4212 403.1306 415.8869 479.7039 506.0201 539.1256 561.2841 605.7791 630.0869 650.6850 677.7103 725.0654 725.7966 754.0590 767.0187 786.8675 794.4059 815.3645 833.3772 838.9187 852.9582 877.7748 891.3228 928.1650 933.0469 939.1604 976.5860 1012.8471 1014.4250 1047.4666 1061.5215 1069.2100 1074.9423 1077.2144 1083.1019 1109.8354 1116.2219 1126.1760 1132.6885 1151.9266 1186.3860 1212.7036 1237.6349 1243.9515 1249.2176 1262.4583 1278.3147 1288.0978 1301.3298 1313.4011 1340.6972 1345.2994 1359.9760 1365.0676 1390.7822 1397.2310 1413.8708 1442.6807 1445.2378 1448.7835 1467.2333 1471.6541 1475.6420 1476.7698 1477.6518 1483.2134 1485.4908 1487.4267 1610.7615 1629.5970 1639.4415 2961.2852 2968.0993 2973.1782 2980.4743 2991.3620 2997.9617 3000.0180 3004.6381 3020.1309 3032.3692 3051.2698 3052.2295 3069.9389 3072.5815 3093.0410 3104.1149 3104.5469 3151.3218 3173.1692 3183.2921
redmass: 4.8019 2.9921 3.6794 3.3477 3.8550 1.5401 3.3968 2.5352 2.9368 3.6846 3.3161 3.1302 1.4602 2.8476 2.0116 2.0346 3.5022 4.0274 5.5164 5.3071 3.0780 4.6376 3.1319 4.0926 4.0970 3.1165 4.2148 6.4270 4.7230 3.9911 9.3143 2.4703 1.4298 1.9586 3.4860 4.7396 1.3824 1.4980 1.7678 7.6516 4.7762 1.5094 2.1213 2.5343 1.5172 1.3879 4.9703 2.3931 2.4683 2.4377 3.1237 1.4975 2.3180 2.3807 1.7296 2.1031 1.7863 1.0678 2.7968 1.7549 1.7269 1.4892 1.2682 1.1806 4.1961 1.3496 1.2479 1.0624 1.2070 1.5052 1.8000 1.6244 1.6429 1.3272 1.2181 1.2104 2.8058 3.9471 1.0849 1.1127 1.0682 1.0407 1.4639 1.3318 1.0462 1.0516 1.4081 1.0828 7.7988 8.3083 9.4928 1.0597 1.0615 1.0362 1.0601 1.0629 1.0373 1.0600 1.0963 1.0944 1.0927 1.1015 1.0957 1.1007 1.0993 1.1005 1.1112 1.1001 1.0899 1.0928 1.0961
irintensity: 0.0667 0.0677 0.4445 0.8578 0.2772 0.0457 4.1912 13.5918 1.2089 1.5125 1.9949 0.1525 0.3569 0.9110 0.3707 1.1985 0.9135 7.3565 10.1610 1.0551 2.8289 7.2053 4.4253 3.4192 6.9863 3.5349 12.1757 3.2172 9.5211 9.4643 0.6858 5.3518 3.9462 19.0121 16.6535 4.3455 15.8607 47.9636 4.0944 39.1079 42.2788 18.7229 5.7066 21.1000 12.5416 13.4067 134.2049 4.2981 71.0317 58.0774 22.9969 7.8610 52.3028 8.8565 0.5100 28.3039 3.3385 1.5362 268.5265 4.9788 20.3662 3.7501 3.8887 2.2916 208.6277 25.2961 6.9795 1.3016 4.0196 18.9729 42.8071 21.6193 4.9197 4.4265 13.4626 19.8578 2.8376 72.5972 23.8863 6.1558 0.5558 11.4070 33.1133 44.3559 13.5135 14.2818 37.2760 18.0694 6.0479 2.4689 133.5049 2.8417 36.8959 42.3803 50.7914 18.3763 27.7092 124.2061 6.2561 4.2293 4.8158 38.5835 6.6089 91.4894 52.5248 32.4994 33.2986 27.0762 4.4208 2.1680 3.4155
temp: 298.150 k
press: 1.00000 atm
elementType: 8 8 8 8 6 6 6 6 6 6 6 6 6 6 6 6 6 6 6 1 1 1 1 1 1 1 1 1 1 1 1 1 1 1 1 1 1 1 1
symmnumber: 1
zpe: 840463.7 jmol-1
zpe.correction: 0.320116 hartree
zpe.thermalcorrener: 0.340323 hartree
zpe.thermalcorrenthalpy: 0.341267 hartree
zpe.thermalcorrgfe: 0.267340 hartree
zpe.sumelectzpe: -883.030059 hartree
zpe.sumelectthermal: -883.009852 hartree
zpe.sumelectthermalent: -883.008908 hartree
zpe.sumelectthermalfe: -883.082835 hartree
dipole: 0.1670 -0.7464 -1.6080
dipole: 1.7806
quadrupole: -103.1122 -113.4561 -112.8814
quadrupole: 0.8352 -2.0743 -6.3986
quadrupole: 6.7044 -3.6396 -3.0648 0.8352 -2.0743 -6.3986
hfenergy: -883.3501752 hartree
pointgroup: C01 [X(C15H20O4)]
dipole: -0.0135748 0.2817158 -0.6412549 debye
polarizability: 218.6414292|-18.3208293|153.7587567|3.1929546|-11.2696574|154.1541612 unknown
InChI: InChI=1S/C15H20O4/c1-3-5-6-12(19-15(16)4-2)11-7-8-13-14(9-11)18-10-17-13/h7-9,12H,3-6,10H2,1-2H3
charge 0 multiplicity 1
39 atoms
O  1.321417 -1.012409 -0.458467
O  -3.314428 1.662984 -1.644934
O  -4.570547 1.294595 0.366568
O  0.92978 -2.53523 1.270586
C  1.032237 0.140576 0.485661
C  1.913655 1.301758 -0.000906
C  3.426434 1.028532 0.140172
C  -0.460948 0.424117 0.485504
C  4.291466 2.212404 -0.348617
C  -1.100466 0.913961 -0.694118
C  -1.214208 0.198392 1.663527
C  -2.470786 1.153734 -0.622177
C  -3.212192 0.937333 0.560556
C  -2.610554 0.460035 1.725958
C  5.805405 1.949041 -0.200793
C  1.186207 -2.302784 0.066844
C  -4.690127 1.587842 -1.087274
C  1.379217 -3.340831 -1.029045
C  1.644147 -4.752457 -0.474164
H  1.344157 -0.187861 1.494674
H  1.674025 1.529804 -1.058087
H  1.637829 2.200108 0.587121
H  3.666449 0.81485 1.202909
H  3.687652 0.117371 -0.432432
H  4.016618 3.125844 0.21783
H  4.053413 2.42263 -1.411433
H  -0.543665 1.080862 -1.619695
H  -0.709729 -0.208377 2.545907
H  -3.188233 0.287609 2.637178
H  6.111777 1.059831 -0.783443
H  6.402697 2.80852 -0.556626
H  6.07422 1.765019 0.856559
H  -5.234222 0.758511 -1.5773
H  -5.183887 2.563455 -1.216356
H  2.192002 -3.000442 -1.695834
H  0.45849 -3.33287 -1.646595
H  0.843497 -5.055002 0.221512
H  1.694025 -5.486593 -1.297534
H  2.59718 -4.789663 0.081866
