program: Gaussian 09
title: 000221413
version: EM64L-G09RevD.01
frameworkgroup: C1[X(C14H27BrO2)]
method: RPBEPBE
basis: SDD
operation: Freq
keyword: #p
keyword: freq=noraman
keyword: PBEPBE/SDD
title: #p freq=noraman PBEPBE/SDD
converged: YES YES NO NO
title: Mulliken charges:
elementType: Br O O C C C C C C C C C C C C C C H H H H H H H H H H H H H H H H H H H H H H H H H H H
charge: 0.015590 -0.237099 -0.223911 -0.386816 -0.383782 -0.383478 -0.382647 -0.385305 -0.372113 -0.375868 -0.353720 -0.373473 -0.356321 -0.318836 -0.696703 0.349415 -0.770781 0.196427 0.193734 0.192358 0.193692 0.195668 0.192826 0.191769 0.193133 0.202280 0.196448 0.188949 0.189464 0.192035 0.200952 0.188158 0.187521 0.216045 0.233870 0.194689 0.194572 0.235063 0.226638 0.209699 0.214986 0.209828 0.302073 0.302969
chargesum: 0.00000
title: Mulliken charges with hydrogens summed into heavy atoms:
elementType: Br O O C C C C C C C C C C C C C C
charge: 0.015590 -0.237099 -0.223911 0.003345 0.002268 0.005016 0.002255 0.013423 0.006301 0.017119 0.021959 0.076441 0.032940 0.142865 -0.062189 0.349415 -0.165739
polarizability: 2.18921014e+02 1.46660216e+00 1.66139120e+02 1.45035798e+00 -2.77555079e+00 1.37883420e+02
1716.lowfreq: -5.8500 -2.0073 -0.0012 -0.0007 0.0011 9.1973 14.0306 17.5626 29.5383
frequency: 13.9852 17.0565 29.4933 37.1490 38.3728 47.9624 61.1084 66.1880 83.2761 92.8729 99.8398 125.3277 130.8518 137.2239 150.8649 153.8981 159.4770 180.2060 234.8254 246.3088 270.1411 289.4773 330.6133 379.6342 416.0301 445.1545 485.7327 492.5831 530.6186 641.2371 720.4091 722.5245 724.5663 728.8433 742.0304 761.3771 778.9374 798.3879 838.0837 886.2149 888.5343 900.1343 940.9038 950.3136 981.2309 989.7470 993.9151 1017.2771 1031.8426 1034.4110 1051.4652 1069.4722 1075.7362 1079.9483 1080.9753 1085.0650 1092.2019 1124.4344 1168.6267 1184.3062 1204.7625 1207.6022 1218.7853 1233.8618 1234.9623 1235.1576 1258.7087 1262.3001 1277.8687 1280.8022 1285.0682 1288.9669 1293.0185 1293.5747 1299.2931 1299.7720 1314.7923 1336.5218 1351.1439 1355.1847 1357.9520 1358.7428 1370.5296 1390.2309 1426.7226 1453.3520 1459.9236 1460.1982 1463.3492 1463.9180 1466.4692 1469.7659 1474.5977 1477.9718 1479.6268 1484.3040 1487.9802 1489.6604 1634.1010 2948.5557 2948.7541 2950.5030 2951.5573 2954.0353 2955.9541 2960.7771 2965.3003 2968.0130 2971.3333 2981.5250 2984.8365 2989.7546 2993.2248 2996.1997 3003.3664 3014.1192 3022.3413 3025.0722 3034.7174 3041.9547 3056.2454 3067.8072 3069.8490 3084.6316 3105.0719 3181.9044
redmass: 5.1149 4.5706 6.1449 3.1223 2.6506 2.7633 2.9328 2.0846 3.8867 2.3286 1.9408 2.0812 2.0332 4.6737 1.9820 2.1207 4.4895 5.3387 1.1197 3.7440 2.7555 3.9803 3.3398 3.3634 3.0435 3.8580 3.5076 3.1996 5.4282 4.6849 1.0594 1.0850 5.9548 1.0886 1.1041 1.1919 2.2010 1.4161 1.2553 1.3137 1.8925 1.7030 1.4728 3.3566 4.9573 2.7027 1.4550 3.9037 1.1681 2.8623 3.2287 2.7013 2.5257 2.1021 2.2125 1.6752 2.2373 3.0159 1.7827 1.7611 1.2707 1.5091 1.6205 1.3772 1.3444 1.5287 1.2954 1.2924 1.1731 1.0545 1.0801 1.2192 1.1460 1.0924 1.1043 1.1205 1.3332 1.3959 1.4884 1.7002 1.6436 1.6035 1.3670 1.2180 1.1179 1.0963 1.0743 1.0740 1.0679 1.0721 1.0714 1.0828 1.0847 1.0423 1.0868 1.0908 1.0938 1.0960 9.5286 1.0587 1.0586 1.0591 1.0593 1.0590 1.0594 1.0592 1.0588 1.0586 1.0365 1.0961 1.0971 1.0983 1.0618 1.0984 1.1023 1.1041 1.0583 1.1048 1.1048 1.1045 1.1036 1.1007 1.0992 1.0557 1.1082 1.1125
irintensity: 0.1607 0.0949 0.5550 0.6078 0.2315 0.6413 0.5486 0.1540 0.0573 0.2019 0.1739 0.0234 0.0947 0.2790 0.0116 0.0124 0.3028 1.1628 0.0221 1.8125 13.1543 1.1581 1.5042 3.4990 0.8891 3.5853 1.3821 1.7256 22.5951 16.2406 17.9127 0.0126 0.2652 7.2863 0.5428 5.8464 3.0983 2.0482 0.7094 0.4900 5.7188 3.2349 16.9007 57.5474 0.9932 8.0826 5.5551 6.5990 0.4277 2.1878 3.1523 0.5177 6.1501 0.8748 0.7294 78.9034 60.0209 9.4899 1.5996 0.0562 26.5982 3.5018 126.5924 15.2621 18.3927 68.7731 2.6568 4.4896 2.7228 0.2708 1.1185 1.9721 0.8335 0.4831 0.0378 0.6977 0.9467 1.0733 0.4864 0.2683 0.4162 0.1698 0.9610 11.1968 19.9741 9.4299 0.0355 0.1610 0.0218 0.2622 0.2914 0.7435 0.9531 12.2900 1.7004 1.7257 2.4836 43.9013 175.7961 0.0037 0.0200 0.2488 1.2486 2.4718 2.9503 5.9815 85.2694 225.2586 37.6876 0.3008 0.2265 0.2848 18.5008 2.0296 0.9064 0.0901 43.6442 6.0114 0.6863 242.7578 58.3383 98.5752 55.5452 7.1684 26.2797 0.4567
temp: 298.150 k
press: 1.00000 atm
elementType: 35 8 8 6 6 6 6 6 6 6 6 6 6 6 6 6 6 1 1 1 1 1 1 1 1 1 1 1 1 1 1 1 1 1 1 1 1 1 1 1 1 1 1 1
symmnumber: 1
zpe: 1012389.9 jmol-1
zpe.correction: 0.385599 hartree
zpe.thermalcorrener: 0.407975 hartree
zpe.thermalcorrenthalpy: 0.408920 hartree
zpe.thermalcorrgfe: 0.327369 hartree
zpe.sumelectzpe: -712.194983 hartree
zpe.sumelectthermal: -712.172606 hartree
zpe.sumelectthermalent: -712.171662 hartree
zpe.sumelectthermalfe: -712.253212 hartree
dipole: -0.9965 -1.7581 -1.4778
dipole: 2.5036
quadrupole: -116.7697 -115.9348 -121.0171
quadrupole: -7.6245 -4.9657 2.0574
quadrupole: 1.1375 1.9724 -3.1099 -7.6245 -4.9657 2.0574
hfenergy: -712.5805815 hartree
pointgroup: C01 [X(C14H27Br1O2)]
dipole: -0.3079801 0.631215 0.6905824 debye
polarizability: 217.7917131|-7.5119432|167.3565669|-2.5316309|2.2029751|137.7952745 unknown
InChI: InChI=1S/C14H27BrO2/c1-2-3-4-5-6-7-8-9-10-11-12-17-14(16)13-15/h2-13H2,1H3
charge 0 multiplicity 1
44 atoms
Br 6.739425 -3.108377 -0.342657
O  5.45121 0.007651 0.647915
O  5.641039 0.129679 -1.681215
C  -2.167052 -0.282277 -0.015338
C  -3.498746 0.484813 0.145173
C  -0.922952 0.589589 0.266726
C  -4.745549 -0.379796 -0.147265
C  0.407925 -0.18647 0.150459
C  -6.076236 0.383885 0.037678
C  1.648963 0.696137 0.41346
C  -7.325435 -0.476012 -0.258692
C  2.973369 -0.100587 0.346877
C  -8.654849 0.288944 -0.066278
C  4.184035 0.806597 0.597054
C  -9.898801 -0.576216 -0.362884
C  6.048023 -0.284915 -0.571926
C  7.273562 -1.152679 -0.360756
H  -2.101378 -0.693231 -1.044453
H  -2.164508 -1.157067 0.668556
H  -3.566619 0.886505 1.178108
H  -3.498256 1.366161 -0.530329
H  -0.910931 1.448134 -0.437257
H  -1.004897 1.024366 1.285116
H  -4.738833 -1.269301 0.517411
H  -4.686998 -0.768634 -1.185513
H  0.486412 -0.635554 -0.861098
H  0.401551 -1.033599 0.867723
H  -6.135406 0.76869 1.077593
H  -6.081316 1.276256 -0.623272
H  1.551936 1.173316 1.411166
H  1.672366 1.520699 -0.329081
H  -7.270988 -0.857335 -1.300047
H  -7.320647 -1.370629 0.399195
H  2.962995 -0.908396 1.103696
H  3.073113 -0.578051 -0.646125
H  -8.659007 1.182186 -0.724255
H  -8.707547 0.670352 0.974094
H  4.284239 1.572032 -0.193975
H  4.142587 1.284017 1.589709
H  -9.937815 -1.457078 0.30578
H  -10.834466 -0.004075 -0.222354
H  -9.88333 -0.948266 -1.404893
H  7.747923 -0.968756 0.612105
H  7.970391 -1.048308 -1.202026
