program: Gaussian 09
title: 000221406
version: EM64L-G09RevD.01
frameworkgroup: C1[X(C13H9ClN2O3)]
method: RPBEPBE
basis: SDD
operation: Freq
keyword: #p
keyword: freq=noraman
keyword: PBEPBE/SDD
title: #p freq=noraman PBEPBE/SDD
converged: NO YES NO NO
title: Mulliken charges:
elementType: Cl O O O N N C C C C C C C C C C C C C H H H H H H H H H
charge: -0.034096 -0.257662 -0.200177 -0.210136 -0.483833 0.018165 0.547613 0.265921 -0.599515 0.144638 0.427451 -0.354065 -0.388143 -0.170299 -0.327166 -0.335608 -0.208566 -0.219411 -0.099161 0.321352 0.280667 0.320807 0.288672 0.241892 0.281467 0.221832 0.264549 0.262808
chargesum: 0.00000
title: Mulliken charges with hydrogens summed into heavy atoms:
elementType: Cl O O O N N C C C C C C C C C C C C C
charge: -0.034096 -0.257662 -0.200177 -0.210136 -0.162481 0.018165 0.547613 0.265921 -0.318848 0.144638 0.427451 -0.033258 -0.099471 0.071593 -0.045699 -0.113776 0.055983 0.043398 -0.099161
polarizability: 3.26834844e+02 7.38004828e+00 1.85313775e+02 5.91913974e+00 -4.91240321e+00 6.97796663e+01
1716.lowfreq: -5.8506 -2.5020 -0.0012 -0.0012 0.0007 6.0257 27.6884 31.2577 45.8501
frequency: 27.5959 31.2067 45.8443 60.8925 78.7436 101.7909 153.6166 171.5139 190.6584 223.7142 243.7950 288.6684 314.9726 321.9100 396.9548 402.2416 407.8547 427.4095 468.1009 508.8561 526.8601 536.8811 587.6033 622.1961 641.1404 654.9207 677.0710 685.3964 708.6499 713.7057 742.9752 764.4804 821.3941 822.5788 851.0795 864.2355 899.5170 916.1798 951.4589 953.6851 984.5065 986.3096 999.3483 1010.9703 1074.0915 1085.0603 1090.2715 1092.9819 1115.8416 1176.9293 1189.8436 1216.8922 1246.9027 1255.8178 1296.0202 1307.8141 1367.7704 1371.9913 1383.3188 1396.9694 1432.7115 1473.5580 1483.0695 1512.3260 1569.1979 1591.7578 1597.0274 1611.2160 1622.6865 3126.4173 3153.0540 3156.5435 3160.6269 3174.1125 3180.6019 3191.2397 3199.2236 3535.0035
redmass: 4.3939 8.1329 10.4170 10.3693 7.5308 8.0529 8.7288 5.5043 9.2618 6.2714 6.4305 6.1791 7.2360 7.1097 7.1028 8.7055 2.9219 3.3465 4.1407 6.1551 6.4056 4.0455 6.4888 6.3730 1.4233 6.2990 4.7082 2.2447 5.6311 7.4846 3.5705 9.0849 1.3806 1.4341 1.5759 4.9825 5.5885 1.6240 1.3781 1.3653 5.9171 1.3944 4.0371 1.3377 3.4243 1.8625 2.0340 1.9991 1.4089 1.1524 1.1325 6.8160 3.2369 1.9432 1.2809 1.6333 4.7977 6.6567 6.7394 4.0990 4.0649 2.3084 2.9329 2.2499 7.3734 6.5632 6.0754 4.5334 7.2890 1.0897 1.0920 1.0898 1.0891 1.0952 1.0973 1.0940 1.0966 1.0761
irintensity: 1.2302 0.0498 1.5156 0.3968 8.5707 1.7910 6.8317 0.4813 2.3608 2.6368 2.0469 1.3315 2.1455 0.7002 6.9228 5.1315 0.6881 0.5463 21.2553 11.0857 10.0286 21.3746 8.8957 3.8821 30.9351 11.7841 24.6080 10.8983 35.9747 17.7684 35.3777 13.8042 53.6238 3.6757 31.0661 24.5873 14.7894 48.8006 0.5468 0.1614 0.2928 4.8885 51.8003 4.3602 45.0418 7.6150 60.3560 28.3076 14.2006 14.2103 17.9211 296.1442 111.0713 76.3959 15.5631 116.4000 74.1236 140.7556 74.1926 16.0306 32.5028 38.4381 220.7566 453.7848 22.0670 24.5938 110.0490 80.7644 54.3899 14.6326 7.0743 10.5770 0.0846 1.9634 2.1138 8.1502 6.6555 12.1344
temp: 298.150 k
press: 1.00000 atm
elementType: 17 8 8 8 7 7 6 6 6 6 6 6 6 6 6 6 6 6 6 1 1 1 1 1 1 1 1 1
symmnumber: 1
zpe: 515760.2 jmol-1
zpe.correction: 0.196443 hartree
zpe.thermalcorrener: 0.212484 hartree
zpe.thermalcorrenthalpy: 0.213428 hartree
zpe.thermalcorrgfe: 0.150221 hartree
zpe.sumelectzpe: -1294.631180 hartree
zpe.sumelectthermal: -1294.615139 hartree
zpe.sumelectthermalent: -1294.614195 hartree
zpe.sumelectthermalfe: -1294.677402 hartree
dipole: -2.9485 1.0848 0.1429
dipole: 3.1450
quadrupole: -141.5543 -119.5184 -117.9330
quadrupole: 17.5757 2.9261 -3.2901
quadrupole: -15.2190 6.8168 8.4022 17.5757 2.9261 -3.2901
hfenergy: -1294.8276229 hartree
pointgroup: C01 [X(C13H9Cl1N2O3)]
dipole: 1.1786897 0.3741459 -0.0413244 debye
polarizability: 325.7642553|-13.9741083|186.0926729|7.746866|6.5295923|70.0713571 unknown
InChI: InChI=1S/C13H9ClN2O3/c14-10-6-4-9(5-7-10)13(17)15-11-2-1-3-12(8-11)16(18)19/h1-8,15H
charge 0 multiplicity 1
28 atoms
Cl 6.698473 -1.542876 0.05917
O  1.02091 2.271491 -0.004063
O  -5.906408 -1.102339 0.025765
O  -4.176433 -2.580344 0.166742
N  0.005763 0.155363 0.03348
N  -4.647884 -1.381055 0.068668
C  -1.369301 0.504925 -0.014045
C  2.456917 0.318157 0.003774
C  -2.307639 -0.555271 0.049846
C  1.117816 1.006606 0.004269
C  -3.68174 -0.255713 0.000912
C  -1.833044 1.847826 -0.123811
C  -4.168159 1.064326 -0.111154
C  -3.219742 2.10546 -0.17237
C  3.574471 1.085319 0.4236
C  2.660733 -1.021507 -0.42283
C  4.867563 0.527212 0.447476
C  3.950716 -1.593457 -0.409317
C  5.034715 -0.810329 0.034602
H  0.197996 -0.84203 0.147457
H  -1.999674 -1.602911 0.135172
H  -1.104338 2.658997 -0.162877
H  -5.244631 1.246574 -0.14625
H  -3.562115 3.141624 -0.257929
H  3.407764 2.124823 0.722401
H  1.835539 -1.627855 -0.81547
H  5.727191 1.116717 0.777519
H  4.111643 -2.620836 -0.747136
