program: Gaussian 09
title: 000221396
version: EM64L-G09RevD.01
frameworkgroup: C1[X(C10H14N2O)]
method: RPBEPBE
basis: SDD
operation: Freq
keyword: #p
keyword: freq=noraman
keyword: PBEPBE/SDD
title: #p freq=noraman PBEPBE/SDD
converged: YES YES NO NO
title: Mulliken charges:
elementType: O N N C C C C C C C C C C H H H H H H H H H H H H H H
charge: -0.250425 -0.396051 -0.368853 -0.187484 0.240574 -0.681690 -0.674329 0.455645 -0.416891 -0.344193 -0.197576 -0.207295 -0.265042 0.195546 0.215444 0.214776 0.245829 0.216440 0.216291 0.245110 0.313651 0.307054 0.222003 0.232218 0.222645 0.220216 0.226384
chargesum: 0.00000
title: Mulliken charges with hydrogens summed into heavy atoms:
elementType: O N N C C C C C C C C C C
charge: -0.250425 -0.082400 -0.061799 0.008063 0.240574 -0.005640 0.003513 0.455645 -0.194887 -0.111975 0.025069 0.012921 -0.038658
polarizability: 1.69531521e+02 3.93136282e+00 1.20050970e+02 1.20020209e+01 -5.68372131e+00 8.40773913e+01
1716.lowfreq: -22.5046 -6.7033 0.0003 0.0007 0.0008 3.8255 13.8943 38.1916 40.8939
frequency: -10.2210 38.1439 40.8682 55.4818 178.0725 192.7050 202.2937 213.6499 247.1909 265.2049 282.6921 304.0410 395.2020 406.0303 443.4391 508.5804 530.3287 534.7552 613.4828 637.8262 652.3995 692.3591 724.3571 756.9326 818.7218 826.5848 863.8488 885.2462 921.2595 923.3891 958.7375 963.3859 979.0394 981.8165 1021.7186 1070.7439 1089.5465 1104.1871 1107.0543 1169.6660 1180.4412 1182.0377 1211.2979 1287.9924 1291.5185 1313.5243 1348.2418 1375.3362 1384.1867 1393.7124 1430.0134 1442.7414 1461.6211 1471.6651 1476.7662 1485.0134 1490.8677 1499.7568 1600.7564 1616.2942 1632.9316 2969.3305 2983.4367 2986.1905 3078.6020 3082.6494 3091.5907 3097.6324 3117.4120 3127.2025 3140.6227 3154.0332 3167.9403 3494.1399 3523.2685
redmass: 3.1888 4.2979 5.4277 3.6496 3.5780 1.6326 1.5933 2.0584 1.4075 2.7449 3.0508 3.9423 2.9386 2.8922 2.1401 3.3105 3.7420 1.2028 6.2703 3.5774 3.0158 1.9222 6.0132 1.7370 2.1467 1.7362 3.4337 1.4891 1.1692 3.0547 1.3678 1.4621 1.3016 5.9480 2.1684 2.0780 1.5092 2.1419 2.5326 1.0505 1.1397 1.8985 2.5267 1.3669 3.0248 1.4110 1.6467 1.1913 4.5750 1.2007 1.9953 1.7895 1.0435 1.0504 1.0497 2.4648 1.0667 1.4403 5.3013 6.3359 6.3206 1.0818 1.0349 1.0370 1.1008 1.0999 1.1009 1.1000 1.0867 1.0863 1.0928 1.0942 1.1010 1.0762 1.0788
irintensity: 0.0463 3.6547 3.0980 0.6202 0.2409 6.2056 4.2012 1.6184 6.3205 2.2460 12.6465 5.3656 4.0740 0.1839 58.7787 3.5217 8.3722 171.9037 1.5315 40.1567 11.1346 36.6312 1.6606 86.9524 1.9352 4.9411 2.7880 8.6793 7.3109 9.7326 0.2821 0.2412 0.6150 0.6551 5.1590 34.2562 7.5039 79.0059 0.3319 0.9091 6.7513 5.0560 70.5040 0.2255 20.1502 4.1383 4.9452 15.5806 20.4144 15.4619 55.2306 84.5305 4.5390 2.8941 17.7620 96.6095 23.6621 22.0806 14.6662 143.0778 95.0057 36.0961 31.8125 26.3194 21.1320 54.3761 3.5752 38.9895 10.6473 1.2946 25.0239 36.2925 14.9174 18.8176 30.7516
temp: 298.150 k
press: 1.00000 atm
elementType: 8 7 7 6 6 6 6 6 6 6 6 6 6 1 1 1 1 1 1 1 1 1 1 1 1 1 1
symmnumber: 1
zpe: 587317.1 jmol-1
zpe.correction: 0.223697 hartree
zpe.thermalcorrener: 0.236246 hartree
zpe.thermalcorrenthalpy: 0.237190 hartree
zpe.thermalcorrgfe: 0.184024 hartree
zpe.sumelectzpe: -573.199252 hartree
zpe.sumelectthermal: -573.186703 hartree
zpe.sumelectthermalent: -573.185759 hartree
zpe.sumelectthermalfe: -573.238925 hartree
dipole: -1.2883 0.5839 -2.8242
dipole: 3.1586
quadrupole: -70.8244 -71.7185 -82.8514
quadrupole: -3.0762 8.1469 -0.0187
quadrupole: 4.3071 3.4129 -7.7200 -3.0762 8.1469 -0.0187
hfenergy: -573.4229491 hartree
pointgroup: C01 [X(C10H14N2O1)]
dipole: 0.5366552 0.2223416 1.0985644 debye
polarizability: 170.561701|-1.4832004|119.3821634|8.3891595|7.3781797|83.7160172 unknown
InChI: InChI=1S/C10H14N2O/c1-8(2)10(13)12-11-9-6-4-3-5-7-9/h3-8,11-12H,1-2H3
charge 0 multiplicity 1
27 atoms
O  1.717423 -0.62993 -1.394736
N  0.997398 -0.433763 0.806918
N  -0.175722 -1.177716 0.599965
C  3.153433 0.611535 0.187999
C  1.912992 -0.195538 -0.223595
C  4.435604 -0.185245 -0.15687
C  3.12501 1.975321 -0.55172
C  -1.394519 -0.497097 0.314043
C  -2.501189 -1.259509 -0.149262
C  -1.550002 0.894332 0.541944
C  -3.740649 -0.632099 -0.384913
C  -2.799078 1.508879 0.304652
C  -3.902358 0.756151 -0.157921
H  3.125678 0.798918 1.281734
H  4.490953 -1.134206 0.406955
H  5.334397 0.411995 0.080836
H  4.445737 -0.425868 -1.234143
H  2.225562 2.562668 -0.291478
H  4.017474 2.571578 -0.289215
H  3.120836 1.809005 -1.643181
H  1.225269 -0.202661 1.776396
H  -0.007394 -2.036727 0.065927
H  -2.386633 -2.336575 -0.324135
H  -0.697243 1.488899 0.884456
H  -4.584038 -1.230323 -0.748275
H  -2.906505 2.585854 0.478695
H  -4.867437 1.239523 -0.341678
