program: Gaussian 09
title: 000221390
version: EM64L-G09RevD.01
frameworkgroup: C1[X(C7H15NO)]
method: RPBEPBE
basis: SDD
operation: Freq
keyword: #p
keyword: freq=noraman
keyword: PBEPBE/SDD
title: #p freq=noraman PBEPBE/SDD
converged: NO YES NO NO
title: Mulliken charges:
elementType: O N C C C C C C C H H H H H H H H H H H H H H H
charge: -0.271286 -0.321614 -0.374377 -0.051269 -0.335206 -0.353218 -0.701969 -0.694493 -0.053717 0.181649 0.196280 0.251208 0.198095 0.199119 0.191037 0.193680 0.198157 0.236560 0.219934 0.288770 0.213865 0.210503 0.214512 0.163779
chargesum: 0.00000
title: Mulliken charges with hydrogens summed into heavy atoms:
elementType: O N C C C C C C C
charge: -0.271286 -0.032844 0.003552 0.199940 0.062008 0.031499 -0.047318 -0.055613 0.110062
polarizability: 8.95661855e+01 -2.32593744e+00 9.12594993e+01 -2.72989094e-02 2.27276294e+00 7.66733658e+01
1716.lowfreq: -15.7871 -9.6621 -0.0005 -0.0004 -0.0004 4.2494 10.7713 49.2261 68.8478
frequency: -4.6778 49.1085 68.8339 116.4786 135.1280 192.1982 213.2634 219.8044 228.6565 295.5737 321.3974 388.7006 469.3760 503.9013 584.6329 718.2918 726.6178 774.7584 846.1046 892.3087 905.3195 919.4224 962.6925 1003.1814 1031.7114 1056.9985 1080.0454 1122.4936 1129.3041 1155.6112 1187.1201 1218.1423 1249.2955 1274.3848 1285.6198 1310.7295 1329.4155 1341.7104 1353.0327 1368.4225 1385.2130 1390.2185 1450.8473 1464.0334 1466.1735 1472.8745 1475.0780 1476.1261 1484.1559 1487.2322 1638.1712 2921.4767 2948.4936 2960.0494 2972.4318 2974.1784 2975.4386 2998.0570 3008.0274 3029.9926 3041.5246 3070.3056 3072.0696 3072.6981 3092.1378 3521.3202
redmass: 6.5435 1.5730 2.8613 2.9002 2.0280 3.0006 1.5605 1.3287 1.2928 2.4739 3.6590 2.6164 2.6237 2.8026 1.2272 1.8276 1.7645 1.2748 1.9811 1.7913 1.3504 1.7305 1.5820 1.4144 3.1168 2.1855 2.1900 2.0494 2.0513 2.2422 2.0905 1.6451 1.2964 1.2240 1.0636 1.2999 1.2948 1.4474 1.6448 1.2211 1.2198 1.2168 1.1903 1.1857 1.0756 1.0508 1.0806 1.0425 1.2491 1.1043 5.7582 1.0860 1.0625 1.0589 1.0549 1.0405 1.0378 1.0967 1.0980 1.0889 1.1019 1.1003 1.0976 1.0994 1.1000 1.0776
irintensity: 8.5105 0.5150 1.8190 1.9586 1.2936 9.3599 15.5461 7.6273 8.6478 3.6174 9.5592 1.6977 2.2084 2.3084 113.7853 10.2004 5.7442 0.5638 1.3433 4.7055 3.5934 2.9808 1.1853 4.4410 1.1397 5.8519 1.8092 14.5386 6.7002 10.6937 40.8811 27.8097 3.0868 8.6102 2.9921 0.7703 3.4665 3.8466 0.1106 21.9154 18.3270 8.3496 50.2529 56.5136 2.4799 12.4060 10.1461 11.2323 40.0473 4.2213 265.9978 122.3601 18.6101 20.7681 35.5941 59.5982 34.3628 7.7835 2.4949 4.2847 47.2326 48.0566 81.1451 55.1219 32.6914 9.9677
temp: 298.150 k
press: 1.00000 atm
elementType: 8 7 6 6 6 6 6 6 6 1 1 1 1 1 1 1 1 1 1 1 1 1 1 1
symmnumber: 1
zpe: 555534.5 jmol-1
zpe.correction: 0.211592 hartree
zpe.thermalcorrener: 0.222302 hartree
zpe.thermalcorrenthalpy: 0.223246 hartree
zpe.thermalcorrgfe: 0.174895 hartree
zpe.sumelectzpe: -404.978137 hartree
zpe.sumelectthermal: -404.967427 hartree
zpe.sumelectthermalent: -404.966482 hartree
zpe.sumelectthermalfe: -405.014834 hartree
dipole: -0.9025 3.0097 2.9239
dipole: 4.2921
quadrupole: -60.0142 -62.4182 -54.2613
quadrupole: 5.3309 6.6338 -5.5248
quadrupole: -1.1163 -3.5203 4.6366 5.3309 6.6338 -5.5248
hfenergy: -405.1897288 hartree
pointgroup: C01 [X(C7H15N1O1)]
dipole: -0.4718238 -1.1256275 -1.1669812 debye
dipolederiv: -0.4522948 -0.1361279 -0.0334415 -0.1846795 -0.7165063 -0.1315973 -0.2274562 -0.5065571 -0.8051014 -0.7474059 -0.2447752 -0.0615941 -0.2679351 -1.0762968 -0.1138618 -0.0699382 -0.0273199 -0.2327679 -0.0672786 0.0543477 0.0065151 0.020008 0.0209012 0.0198879 -0.0151983 0.059155 0.193535 0.3992687 0.039685 -0.0411506 0.0768957 0.3887412 -0.1268106 -0.1350266 -0.3313479 0.1684278 -0.0493679 0.0417637 -0.0128481 0.0018167 0.0434028 -0.018053 -0.0166744 -0.0276457 0.145954 0.0698594 0.0292319 -0.006324 0.0729503 0.0887518 -0.0187761 0.0089115 -0.0170506 0.179439 -0.0951647 0.0699047 0.0034418 0.0232058 -0.0590605 0.0390428 0.0495699 0.074491 0.1119006 -0.03776 0.0733598 0.0071722 0.0462067 0.0133649 -0.0141439 -0.0028921 -0.0124959 0.0869762 0.3920033 0.5128049 0.0666423 0.6086597 1.2926794 0.3026966 0.2164652 0.5564345 0.9618059 0.0302678 0.003169 -0.0034962 0.0105827 0.0253463 -0.0762225 -0.0283338 -0.1145487 -0.1543438 0.0236316 -0.0874888 0.0331248 -0.038856 -0.0913949 0.0960282 0.0429333 0.129393 -0.0192762 0.0691375 0.0156103 -0.0045061 0.0042259 0.0505239 -0.0825354 0.0149048 -0.0007403 -0.0296532 0.0514141 -0.0435625 0.0353036 -0.0519765 -0.0878302 0.0899286 0.0418079 0.1100245 -0.0200641 0.0350929 -0.007145 -0.0355149 -0.0005325 0.0289005 -0.072515 -0.0340403 -0.0830431 -0.1268655 0.0304898 0.0162841 0.0000047 -0.0057101 0.0131728 -0.0974028 -0.0416166 -0.1141435 -0.1632499 0.0119345 -0.025018 0.024324 -0.0586368 -0.1133848 0.1130025 0.0513423 0.1328354 -0.017267 0.0822602 -0.0143493 -0.0586806 0.0247338 0.0283003 -0.0564179 -0.0094108 -0.1255617 -0.1307407 -0.1745969 0.0090292 -0.032297 -0.0319217 0.0697004 -0.0134848 -0.0343918 -0.0143014 0.0903777 0.0807367 -0.0564955 0.0750709 -0.0475613 -0.0615652 0.0904631 0.0581172 0.1245916 -0.0255794 0.3216128 -0.0870162 -0.0091229 -0.0913776 0.1381101 -0.0359715 0.0229938 0.0104986 0.0724321 0.0922401 -0.0092309 -0.0481413 0.0226004 0.0375207 -0.0690199 0.0012296 -0.1026322 -0.1457838 0.0724245 -0.0688791 0.0652705 -0.0113762 -0.079187 0.1044411 0.0405669 0.1298614 -0.0160081 -0.2304314 -0.0052922 -0.0362375 -0.0361354 0.0637392 -0.0141709 -0.0468603 -0.0100174 0.0921169 0.0919263 -0.0798099 0.0664849 -0.0851872 -0.0179296 0.0854927 0.1129972 0.1601204 -0.2162641 unknown
polarizability: 89.945178|2.4790521|90.7730204|-0.0196352|2.5384514|76.7808522 unknown
InChI: InChI=1S/C7H15NO/c1-3-4-5-7(2)8-6-9/h6-8H,3-5H2,1-2H3
charge 0 multiplicity 1
24 atoms
O  2.069103 1.832378 0.742022
N  1.431314 0.174023 -0.79387
C  -0.589055 -1.092572 -0.041223
C  0.920924 -0.816411 0.183707
C  -1.49083 0.14255 0.168904
C  -2.987964 -0.15542 -0.074431
C  1.76149 -2.111536 0.122961
C  -3.887436 1.080124 0.144985
C  1.960594 1.399756 -0.440271
H  -0.737683 -1.499022 -1.065401
H  -0.896606 -1.897255 0.657106
H  1.056915 -0.337089 1.171074
H  -1.16404 0.959547 -0.505362
H  -1.353832 0.523659 1.201435
H  -3.122766 -0.533095 -1.109111
H  -3.313265 -0.974618 0.599356
H  1.660263 -2.609825 -0.860885
H  2.829868 -1.893337 0.29396
H  1.425067 -2.825332 0.896424
H  1.404629 -0.075765 -1.786142
H  -3.795832 1.457614 1.180735
H  -3.602094 1.90388 -0.53607
H  -4.952136 0.844111 -0.036251
H  2.297971 1.983131 -1.329053
