program: Gaussian 09
title: 000221386
version: EM64L-G09RevD.01
frameworkgroup: C1[X(C16H23NOS)]
method: RPBEPBE
basis: SDD
operation: Freq
keyword: #p
keyword: freq=noraman
keyword: PBEPBE/SDD
title: #p freq=noraman PBEPBE/SDD
converged: NO YES NO NO
title: Mulliken charges:
elementType: S O N C C C C C C C C C C C C C C C C H H H H H H H H H H H H H H H H H H H H H H H
charge: 0.178618 -0.286307 -0.132612 0.190711 -0.413905 -0.561670 0.441441 -0.790572 -0.720824 0.259361 -0.338308 -0.357151 -0.665288 -0.662274 -0.417445 -0.399967 -0.244922 -0.258810 -0.246353 0.228753 0.214817 0.234355 0.256511 0.218415 0.217039 0.221483 0.221212 0.210240 0.220888 0.228231 0.271011 0.248487 0.237540 0.270871 0.257326 0.255281 0.258630 0.246463 0.234024 0.222129 0.224848 0.227723
chargesum: 0.00000
title: Mulliken charges with hydrogens summed into heavy atoms:
elementType: S O N C C C C C C C C C C C C C C C C
charge: 0.178618 -0.286307 -0.132612 0.190711 0.029665 -0.070803 0.441441 -0.133636 -0.068485 0.259361 0.160934 0.128876 -0.137091 -0.148363 -0.170982 -0.165943 -0.022793 -0.033961 -0.018631
polarizability: 2.04275474e+02 -1.06265618e+01 1.90291862e+02 -1.75868011e+00 -9.10532782e+00 1.78345327e+02
1716.lowfreq: -8.4689 -5.2411 -0.0012 -0.0007 0.0018 3.6437 13.3302 23.7095 32.0856
frequency: 12.2248 23.4276 32.0172 43.2776 65.8037 80.9908 130.6096 152.9561 173.1372 182.3987 212.4662 218.0867 225.9139 247.7717 303.0974 314.7559 323.6900 336.0031 350.5691 394.8928 397.0062 404.1896 413.7650 449.1863 472.2047 511.1109 534.4979 551.1577 566.0494 601.4843 606.0126 617.3361 631.2898 695.8517 705.5010 748.9675 772.9879 787.8850 809.3247 852.6519 866.0974 903.8656 913.1385 926.4329 937.8095 954.8804 960.9019 975.7221 984.5720 988.6383 991.4202 993.2607 1020.9295 1027.2878 1029.6737 1034.3119 1076.4130 1089.1081 1102.0500 1139.2284 1147.7835 1161.9754 1166.7588 1173.1029 1181.9151 1198.6631 1209.0425 1213.5259 1245.0896 1258.3978 1270.0514 1287.8658 1296.7967 1311.3566 1321.5646 1334.8351 1347.4730 1359.6900 1374.4197 1379.5534 1399.0357 1411.6500 1428.5547 1432.1830 1434.4569 1441.1713 1447.6409 1462.5537 1465.9247 1466.3890 1473.3127 1486.2700 1488.1547 1496.7895 1580.5396 1587.5684 1611.1110 2968.5329 2973.2477 2977.1281 2984.1203 2988.0242 3005.0574 3019.7103 3022.4618 3027.7785 3065.1689 3067.9987 3068.7126 3070.0485 3074.7463 3080.1405 3086.4164 3099.3768 3106.3436 3118.9132 3125.6220 3140.2172 3151.8492 3163.8521
redmass: 4.6964 4.8267 4.1441 5.1462 6.9792 3.8658 3.1649 2.4545 2.7995 3.1987 3.3081 1.2170 2.1769 2.9943 4.2982 1.7744 1.5660 2.7111 2.5228 2.0080 2.7482 2.7931 3.1591 3.4302 3.0436 2.6188 3.1308 3.2199 2.9948 3.3907 3.8201 6.3668 4.6731 4.9027 1.6735 3.0391 1.9967 1.5580 1.5725 1.2512 2.4058 3.0347 1.6429 1.5888 1.5454 2.0535 1.7413 1.3922 2.1154 2.2924 2.4822 1.3180 1.5936 2.4544 2.5424 2.1188 2.1715 2.0353 1.9303 1.7572 1.5360 1.4668 1.5974 1.0617 1.5018 1.1268 1.9708 1.6010 2.0212 1.9201 1.4611 1.2455 1.3572 1.3187 1.3886 1.2753 1.4818 1.3198 3.9865 1.3651 1.2088 2.3812 1.0919 2.1364 1.0977 1.1138 1.1150 1.0722 1.0962 1.1094 1.0855 1.9021 1.0661 1.0602 7.4777 5.8533 5.9926 1.0591 1.0349 1.0362 1.0678 1.0631 1.0635 1.0585 1.0966 1.0584 1.1008 1.0999 1.0989 1.0994 1.0989 1.0993 1.0933 1.1069 1.1074 1.0842 1.0874 1.0929 1.0944 1.1002
irintensity: 1.0117 0.2320 0.0090 0.5371 3.0860 0.5505 0.7008 1.3512 4.0756 5.9230 3.1811 0.3455 1.0887 1.0360 0.0608 1.1897 3.3674 0.1584 5.6069 3.3769 1.5488 0.0762 3.5842 0.8350 0.8888 8.1847 3.5360 24.4545 3.2662 3.6864 2.9869 0.0791 0.9702 1.0402 58.2355 5.0017 36.8816 12.8245 0.6775 0.1242 3.2404 2.3523 2.9899 24.2573 4.1068 47.9137 15.3798 0.0305 0.1210 0.4082 0.2478 0.3268 0.7476 13.8050 5.4574 8.1274 5.1398 5.5308 4.7922 4.2335 0.2124 8.4134 10.7145 0.7893 89.8105 1.6564 2.9954 47.8791 9.9893 13.6542 17.5814 29.2131 52.8947 10.9746 1.2335 2.0132 12.3471 6.7113 7.0364 10.8400 17.5916 135.2092 7.7023 13.8801 15.2882 15.5937 25.9851 5.8879 4.9735 0.7812 16.3515 18.4559 11.4872 17.6869 221.6561 1.5662 9.2922 15.3399 35.2997 23.3689 23.7861 48.6477 20.1120 22.1248 6.7376 22.4689 7.5806 4.4367 9.8278 39.0108 97.9115 39.5756 14.2091 18.5255 13.3382 3.8326 2.1805 30.0291 37.2428 15.1987
temp: 298.150 k
press: 1.00000 atm
elementType: 16 8 7 6 6 6 6 6 6 6 6 6 6 6 6 6 6 6 6 1 1 1 1 1 1 1 1 1 1 1 1 1 1 1 1 1 1 1 1 1 1 1
symmnumber: 1
zpe: 936717.4 jmol-1
zpe.correction: 0.356777 hartree
zpe.thermalcorrener: 0.376157 hartree
zpe.thermalcorrenthalpy: 0.377101 hartree
zpe.thermalcorrgfe: 0.306607 hartree
zpe.sumelectzpe: -1150.097065 hartree
zpe.sumelectthermal: -1150.077685 hartree
zpe.sumelectthermalent: -1150.076741 hartree
zpe.sumelectthermalfe: -1150.147236 hartree
dipole: 0.8037 -1.8464 1.7284
dipole: 2.6538
quadrupole: -131.9133 -123.0460 -119.5499
quadrupole: -2.3949 3.0243 3.8554
quadrupole: -7.0769 1.7904 5.2865 -2.3949 3.0243 3.8554
hfenergy: -1150.4538422 hartree
pointgroup: C01 [X(C16H23N1O1S1)]
dipole: -0.3682658 -0.7355542 -0.6429901 debye
polarizability: 205.6668957|9.5215144|189.7725375|-1.700934|8.6030557|177.4732295 unknown
InChI: InChI=1S/C16H23NOS/c1-16(2,14-6-4-3-5-7-14)9-8-15(18)17-10-12-19-13-11-17/h3-7H,8-13H2,1-2H3
charge 0 multiplicity 1
42 atoms
S  5.482378 -1.250043 -0.69749
O  1.777095 1.699104 1.4309
N  2.676541 -0.260735 0.565807
C  -1.968963 1.418644 -0.76556
C  -0.59682 1.64157 -0.044965
C  0.407606 0.484719 -0.209363
C  -2.672386 0.155533 -0.210718
C  -1.749321 1.347696 -2.299434
C  -2.868105 2.658681 -0.470145
C  1.661856 0.697106 0.654495
C  3.904615 -0.082432 1.373448
C  2.664444 -1.439061 -0.322803
C  5.136113 0.188814 0.493439
C  3.737322 -1.339583 -1.42835
C  -3.141053 -0.893369 -1.044076
C  -2.888319 0.026445 1.190291
C  -3.799024 -2.02416 -0.504231
C  -3.541627 -1.09912 1.734886
C  -4.002915 -2.134644 0.888297
H  -0.758233 1.814168 1.03377
H  -0.146336 2.576545 -0.42941
H  0.704802 0.381579 -1.271301
H  -0.079259 -0.469739 0.076589
H  -2.711816 1.31794 -2.842659
H  -1.161235 0.463022 -2.604634
H  -1.204728 2.248469 -2.637784
H  -3.852196 2.556987 -0.963103
H  -2.384954 3.581391 -0.843548
H  -3.042587 2.782353 0.613672
H  4.073745 -0.992415 1.981908
H  3.721087 0.773447 2.046353
H  1.668755 -1.550892 -0.780369
H  2.858615 -2.346812 0.283259
H  5.002888 1.109929 -0.098305
H  6.04753 0.279182 1.107536
H  3.733414 -2.241518 -2.063403
H  3.572107 -0.448328 -2.058401
H  -3.000763 -0.836414 -2.128044
H  -2.540651 0.8140 1.869061
H  -4.152257 -2.816715 -1.174392
H  -3.691741 -1.168463 2.818494
H  -4.51232 -3.009281 1.308081
