program: Gaussian 09
title: 000221369
version: EM64L-G09RevD.01
frameworkgroup: C1[X(C9H19N3O2)]
method: RPBEPBE
basis: SDD
operation: Freq
keyword: #p
keyword: freq=noraman
keyword: PBEPBE/SDD
title: #p freq=noraman PBEPBE/SDD
converged: NO YES NO NO
title: Mulliken charges:
elementType: O O N N N C C C C C C C C C H H H H H H H H H H H H H H H H H H H
charge: -0.456897 -0.304444 0.039234 -0.160171 -0.150890 -0.356634 -0.366831 -0.417407 -0.404215 -0.560839 0.276389 -0.331447 -0.657172 -0.665294 0.247228 0.213100 0.246599 0.243646 0.232903 0.270847 0.265417 0.242622 0.253096 0.202477 0.256611 0.245631 0.200926 0.220015 0.230343 0.269382 0.199353 0.263233 0.213187
chargesum: 0.00000
title: Mulliken charges with hydrogens summed into heavy atoms:
elementType: O O N N N C C C C C C C C C
charge: -0.456897 -0.304444 0.039234 -0.160171 -0.150890 0.103693 0.123414 0.086342 0.103824 0.151345 0.276389 0.115110 0.062568 0.010479
polarizability: 1.56460638e+02 -1.96357072e+00 1.18796120e+02 -4.57823555e+00 -6.32178127e-01 1.03986599e+02
1716.lowfreq: -9.1819 -5.6010 -0.0006 0.0006 0.0007 23.1727 40.7428 67.7464 80.2477
frequency: 40.0348 67.1378 80.0285 97.9015 144.4217 165.7017 184.3532 207.9387 220.4323 232.5208 251.8373 285.4086 313.4657 322.0922 366.6922 373.2685 408.0026 420.8484 441.0571 464.9310 482.4828 547.0035 550.1441 611.7944 664.6126 693.2248 723.2210 760.3455 780.9952 833.8997 844.1074 891.8345 926.2546 951.9788 979.0593 1007.2168 1028.5996 1048.0708 1058.1154 1068.7974 1085.8110 1114.4155 1118.1820 1129.5971 1152.7944 1171.5465 1191.8641 1216.7532 1228.8238 1256.1263 1285.4163 1286.2115 1326.6884 1338.5564 1339.2141 1351.3276 1356.4849 1369.3636 1379.2695 1395.3498 1409.1324 1426.9325 1430.8149 1438.3046 1447.5166 1449.1091 1452.2130 1464.5305 1467.4958 1469.1654 1483.2133 1489.6493 1496.7840 1566.8599 2955.1425 2983.8639 2988.6608 2995.5201 2999.5533 3018.4592 3025.3837 3028.0080 3032.3854 3065.4775 3082.6690 3094.3846 3101.2871 3105.0681 3105.2687 3111.7306 3112.3100 3115.8158 3144.3881
redmass: 3.9802 3.5434 3.1325 3.9738 3.3933 3.7292 2.5756 1.6888 1.1244 1.0581 1.6394 2.6191 2.4240 2.8821 2.3829 2.5699 3.1097 2.2394 2.9165 4.1680 3.0490 4.1899 3.4108 2.4719 3.6100 4.9843 7.4571 2.0590 1.2327 4.9939 2.9732 1.9855 2.2565 2.6307 1.9929 2.6984 2.1189 2.0844 1.7856 1.7408 1.6952 2.0099 1.4569 1.8084 1.7998 2.4075 1.8377 2.4590 1.9642 1.3196 1.3520 1.6168 1.3304 1.4336 1.2446 1.2606 1.2637 1.5178 1.2378 1.7390 1.1787 1.1212 1.0912 1.1552 1.0675 1.1151 1.0926 1.0673 1.1045 1.1790 1.0621 1.0536 1.1685 5.9177 1.0389 1.0365 1.0380 1.0644 1.0595 1.0594 1.0629 1.0975 1.0617 1.0986 1.0983 1.1017 1.0976 1.1023 1.1014 1.0993 1.1002 1.1039 1.1035
irintensity: 3.9485 2.0947 3.8565 7.8057 4.3076 7.7549 3.9644 3.0264 0.2405 0.1274 4.1295 3.3478 0.1679 3.5617 10.4810 28.2150 11.7219 6.4665 4.1415 20.1936 2.3010 2.6517 3.7539 1.9181 0.8630 1.0378 17.0665 1.9724 10.5523 10.0442 5.0377 0.3099 29.9676 2.5505 8.4442 11.5589 49.5010 6.9365 0.4459 22.4701 43.6587 11.0259 22.0730 4.0341 16.2996 16.2708 95.4511 9.3340 5.5552 1.1861 13.1044 141.1268 6.2763 10.1380 12.3453 0.9381 5.5331 1.8529 66.5053 192.1005 2.3142 26.8809 4.6950 49.3700 12.9149 15.4482 19.0909 38.7888 11.1662 29.6024 14.0127 22.3592 86.2791 221.8349 68.1366 31.3415 18.9558 50.8639 30.3215 22.1545 22.9015 40.2441 20.2658 12.6342 39.1267 14.2179 9.0842 13.9527 22.0220 9.2063 12.8292 10.4483 10.4247
temp: 298.150 k
press: 1.00000 atm
elementType: 8 8 7 7 7 6 6 6 6 6 6 6 6 6 1 1 1 1 1 1 1 1 1 1 1 1 1 1 1 1 1 1 1
symmnumber: 1
zpe: 748806.8 jmol-1
zpe.correction: 0.285205 hartree
zpe.thermalcorrener: 0.300310 hartree
zpe.thermalcorrenthalpy: 0.301254 hartree
zpe.thermalcorrgfe: 0.243731 hartree
zpe.sumelectzpe: -667.841802 hartree
zpe.sumelectthermal: -667.826698 hartree
zpe.sumelectthermalent: -667.825753 hartree
zpe.sumelectthermalfe: -667.883276 hartree
dipole: -1.9668 1.1945 3.0907
dipole: 3.8532
quadrupole: -88.2902 -87.3470 -83.6965
quadrupole: -14.4989 9.7338 2.6887
quadrupole: -1.8457 -0.9024 2.7481 -14.4989 9.7338 2.6887
hfenergy: -668.1270075 hartree
pointgroup: C01 [X(C9H19N3O2)]
dipole: 0.765309 0.6969097 -1.1076211 debye
polarizability: 156.3795144|3.4101142|118.1826977|-4.0442356|3.1842585|104.6811444 unknown
InChI: InChI=1S/C9H19N3O2/c1-4-10(2)9(13)11-5-7-12(3,14)8-6-11/h4-8H2,1-3H3
charge 0 multiplicity 1
33 atoms
O  -3.369539 0.577485 0.904504
O  1.316755 -1.573158 -0.316736
N  -2.729522 0.01628 -0.246655
N  0.028689 0.11391 0.710529
N  2.215455 0.579007 -0.133314
C  -1.712664 1.028838 -0.813608
C  -1.969201 -1.270969 0.144422
C  -0.671409 1.348694 0.27543
C  -0.91524 -0.915863 1.203904
C  -3.773813 -0.303173 -1.298478
C  1.193419 -0.356259 0.055342
C  3.365509 0.167195 -0.973759
C  2.40588 1.762541 0.721326
C  4.448221 -0.613786 -0.195894
H  -2.298992 1.927696 -1.06535
H  -1.236756 0.607701 -1.720066
H  -1.494129 -1.71265 -0.750326
H  -2.732198 -1.948541 0.559781
H  0.045167 2.08461 -0.118973
H  -1.215696 1.781268 1.134013
H  -1.439326 -0.514503 2.088684
H  -0.349906 -1.822553 1.468235
H  -4.301021 0.63531 -1.525911
H  -3.31761 -0.733572 -2.209589
H  -4.482298 -1.01053 -0.842969
H  2.975257 -0.469542 -1.785357
H  3.79357 1.082372 -1.426956
H  2.264375 2.711447 0.165533
H  3.432287 1.763104 1.135539
H  1.697813 1.732176 1.564303
H  4.846359 -0.029389 0.654216
H  4.021506 -1.555201 0.188183
H  5.295861 -0.858544 -0.862403
