program: Gaussian 09
title: 000221367
version: EM64L-G09RevD.01
frameworkgroup: C1[X(C8H17N3O2)]
method: RPBEPBE
basis: SDD
operation: Freq
keyword: #p
keyword: freq=noraman
keyword: PBEPBE/SDD
title: #p freq=noraman PBEPBE/SDD
converged: YES YES NO NO
title: Mulliken charges:
elementType: O O N N N C C C C C C C C H H H H H H H H H H H H H H H H H
charge: -0.456988 -0.305766 0.038956 -0.152821 -0.153685 -0.355243 -0.366430 -0.415850 -0.401715 -0.560502 0.275997 -0.608725 -0.646923 0.247484 0.213014 0.247128 0.244113 0.234994 0.271551 0.265674 0.243996 0.252534 0.202612 0.257169 0.214581 0.271881 0.223106 0.220840 0.228103 0.270916
chargesum: 0.00000
title: Mulliken charges with hydrogens summed into heavy atoms:
elementType: O O N N N C C C C C C C C
charge: -0.456988 -0.305766 0.038956 -0.152821 -0.153685 0.105255 0.124811 0.090695 0.107955 0.151813 0.275997 0.100843 0.072936
polarizability: 1.40748324e+02 -3.47037561e+00 1.09017530e+02 5.17248740e+00 7.19379631e-01 9.56888233e+01
1716.lowfreq: -19.3801 -12.7694 -0.0006 0.0000 0.0004 12.9661 47.9044 76.1783 97.7770
frequency: 47.6901 76.1298 97.7670 122.7876 148.7599 165.7748 197.9711 225.7218 226.8583 250.4784 284.2883 320.9291 337.3671 366.7545 378.9284 418.1318 436.3049 455.6242 470.1668 535.8395 551.1316 608.4587 661.7138 695.9986 723.6192 754.6435 834.9709 873.2520 889.8006 933.1303 976.3322 987.5645 1025.9468 1046.2384 1054.2459 1056.8726 1097.9912 1111.0369 1128.1102 1140.9393 1151.8605 1169.5942 1193.2522 1227.3497 1241.2482 1256.3739 1283.9721 1326.6086 1332.1713 1341.1056 1356.4471 1364.8461 1388.2238 1407.6615 1416.6459 1424.3358 1428.0056 1437.0335 1446.0599 1449.6419 1460.7909 1464.8786 1468.7081 1479.3588 1488.4414 1503.8199 1574.2011 2949.5027 2959.7033 2988.7429 2999.4165 3016.5287 3019.6441 3027.3026 3033.1481 3034.0822 3094.9442 3105.0390 3105.8567 3111.2806 3112.8989 3116.4634 3122.3780 3145.9664
redmass: 4.0386 4.7740 3.3578 1.4824 1.7383 4.2494 1.3624 2.1999 1.2851 1.7856 2.5531 2.9853 2.4745 2.4572 2.6593 2.2247 2.9035 3.8952 3.3024 4.5008 3.8883 2.5250 3.6213 5.1808 7.8702 2.1065 6.6067 3.1417 2.0606 2.4777 2.0058 2.5488 2.1640 2.1251 1.6345 1.4758 1.2275 2.3377 1.8198 1.3902 1.7952 2.4286 1.8186 1.7123 5.1808 1.3272 1.3556 1.3607 1.5315 1.2854 1.3540 1.4633 1.8879 1.1807 1.1632 1.1075 1.0934 1.1541 1.0626 1.0999 1.1579 1.0516 1.0967 1.0523 1.0489 1.2850 5.4596 1.0374 1.0394 1.0388 1.0591 1.1006 1.0593 1.0624 1.0616 1.0986 1.1014 1.0971 1.1022 1.1008 1.0992 1.1040 1.0965 1.1035
irintensity: 5.9082 7.1220 5.0845 0.0508 2.3811 8.4318 4.6777 2.4130 0.3362 11.9995 1.1131 2.5786 3.9635 12.8274 24.3146 8.5106 5.8996 20.0219 2.3140 4.0458 5.2037 2.2131 0.9443 1.3443 12.9112 1.6249 14.6793 8.1821 2.0794 21.8485 6.8577 22.4040 42.1841 6.7785 1.8635 6.2765 0.6179 51.9279 3.9620 3.4584 21.7349 15.9541 142.8613 21.6587 21.8455 5.8920 13.8210 4.7130 12.9098 13.7009 21.6886 3.3109 239.2220 2.9353 36.8487 21.9419 5.5883 37.7293 16.2381 21.1634 50.1541 10.5833 8.1658 13.3373 20.9214 83.7999 250.4471 56.6285 114.7524 17.4274 29.2748 52.8645 21.4333 23.0196 18.8208 37.4643 13.8145 15.6902 5.5321 2.2446 17.7712 10.5149 4.1266 10.3467
temp: 298.150 k
press: 1.00000 atm
elementType: 8 8 7 7 7 6 6 6 6 6 6 6 6 1 1 1 1 1 1 1 1 1 1 1 1 1 1 1 1 1
symmnumber: 1
zpe: 674345.7 jmol-1
zpe.correction: 0.256845 hartree
zpe.thermalcorrener: 0.270798 hartree
zpe.thermalcorrenthalpy: 0.271742 hartree
zpe.thermalcorrgfe: 0.216967 hartree
zpe.sumelectzpe: -628.616468 hartree
zpe.sumelectthermal: -628.602515 hartree
zpe.sumelectthermalent: -628.601571 hartree
zpe.sumelectthermalfe: -628.656346 hartree
dipole: 2.0148 -1.1930 3.1298
dipole: 3.9087
quadrupole: -78.6271 -83.6522 -77.0500
quadrupole: -15.1024 -8.3388 -2.9886
quadrupole: 1.1493 -3.8758 2.7265 -15.1024 -8.3388 -2.9886
hfenergy: -628.873313 hartree
pointgroup: C01 [X(C8H17N3O2)]
dipole: 0.7503939 0.7901295 -1.0850896 debye
polarizability: 140.270815|5.7506961|108.1367093|-4.9650415|3.6640899|97.0471531 unknown
InChI: InChI=1S/C8H17N3O2/c1-9(2)8(12)10-4-6-11(3,13)7-5-10/h4-7H2,1-3H3
charge 0 multiplicity 1
30 atoms
O  -2.968064 0.618094 1.003644
O  1.529328 -1.725386 -0.51933
N  -2.390231 0.109997 -0.203521
N  0.391734 -0.043043 0.675269
N  2.562299 0.360155 -0.233605
C  -1.322763 1.100031 -0.717779
C  -1.705821 -1.249491 0.066806
C  -0.238133 1.265267 0.362161
C  -0.606229 -1.045981 1.119011
C  -3.475173 -0.063685 -1.248738
C  1.496503 -0.53361 -0.06234
C  3.639927 -0.017403 -1.161241
C  2.874431 1.446005 0.709495
H  -1.855478 2.050912 -0.881988
H  -0.895318 0.72326 -1.666986
H  -1.282652 -1.649784 -0.872316
H  -2.500806 -1.907513 0.452493
H  0.513764 1.985062 0.005752
H  -0.731401 1.658993 1.268783
H  -1.081151 -0.679878 2.045779
H  -0.095224 -2.004156 1.298619
H  -3.941816 0.921197 -1.398064
H  -3.066753 -0.458953 -2.197527
H  -4.219732 -0.753075 -0.824369
H  3.936608 0.854578 -1.774314
H  3.28234 -0.828257 -1.812964
H  4.53254 -0.384813 -0.614806
H  2.812808 2.446317 0.234995
H  3.906383 1.317285 1.092982
H  2.182579 1.410375 1.565001
