program: Gaussian 09
title: 000000832
version: EM64L-G09RevD.01
frameworkgroup: C1[X(C4H8NO7P)]
method: RPBEPBE
basis: SDD
operation: Freq
keyword: #p
keyword: freq=noraman
keyword: PBEPBE/SDD
title: #p freq=noraman PBEPBE/SDD
converged: YES YES NO NO
title: Mulliken charges:
elementType: P O O O O O O O N C C C C H H H H H H H H
charge: 1.392881 -0.516018 -0.500012 -0.172112 -0.191014 -0.693829 -0.651243 -0.558439 -0.560144 -0.207513 -0.469007 0.240239 0.207515 0.296631 0.284447 0.251498 0.294677 0.293612 0.409818 0.445548 0.402465
chargesum: 0.00000
title: Mulliken charges with hydrogens summed into heavy atoms:
elementType: P O O O O O O O N C C C C
charge: 1.392881 -0.516018 -0.090195 -0.172112 -0.191014 -0.248281 -0.248779 -0.558439 0.028145 0.089118 0.066938 0.240239 0.207515
polarizability: 1.24776571e+02 3.17156671e+00 8.00241114e+01 -3.67449779e-01 3.66491496e+00 8.62675632e+01
1716.lowfreq: -9.2775 -0.0016 0.0005 0.0017 1.9322 7.0868 33.9324 56.3642 68.4020
frequency: 33.7992 56.3600 68.3822 71.8017 117.7539 127.1983 131.1412 164.9831 193.5439 229.6262 238.4308 265.3592 282.8270 301.4419 327.2786 335.7004 361.7471 395.3767 452.9468 536.3269 566.1269 580.2257 606.9229 628.5568 660.2414 677.7381 708.5661 717.8680 752.2037 780.0171 852.6800 958.8763 970.7620 1003.0365 1020.8770 1077.2079 1091.2326 1142.7457 1182.9496 1192.5904 1207.1896 1273.1172 1296.2883 1308.9907 1378.0157 1443.0311 1651.8764 1666.9341 1686.5316 3037.8853 3066.3553 3115.4575 3174.2183 3477.6525 3497.7382 3594.0826 3604.9548
redmass: 8.6187 9.4999 8.4800 7.9617 5.9416 6.9432 5.4635 3.8381 1.3808 3.8315 2.3854 4.0024 2.9561 2.7099 8.3519 4.0774 7.5769 4.6945 4.3947 1.3311 3.6357 2.4872 2.2928 4.1644 2.5809 2.3095 6.6116 2.9059 3.6816 8.0911 6.6125 2.8556 2.6586 2.5047 1.5932 2.1805 2.5911 3.2996 1.7685 1.4871 1.5405 1.2678 1.4365 1.3202 1.3119 1.0857 1.0961 11.1786 8.2986 1.0587 1.0855 1.1052 1.0709 1.0455 1.0639 1.0663 1.0985
irintensity: 0.7128 3.9775 0.6695 3.2944 2.1007 4.2536 34.5945 18.7918 28.9462 13.7817 36.4156 14.3319 30.6995 31.0067 36.5855 30.2164 25.0148 62.4867 14.8308 47.8077 6.4420 66.2087 225.1571 63.9435 41.8362 47.8169 178.2450 169.5111 3.2708 168.6414 271.4193 33.3230 99.0054 130.6979 8.4936 239.0746 133.9610 40.9708 85.7138 129.7035 35.2653 23.3249 5.5338 3.8436 1.4106 17.8491 60.7564 199.4682 251.6898 2.5983 3.6083 4.2023 961.2295 7.8374 39.7206 85.3988 11.7781
temp: 298.150 k
press: 1.00000 atm
elementType: 15 8 8 8 8 8 8 8 7 6 6 6 6 1 1 1 1 1 1 1 1
symmnumber: 1
zpe: 366917.2 jmol-1
zpe.correction: 0.139751 hartree
zpe.thermalcorrener: 0.155041 hartree
zpe.thermalcorrenthalpy: 0.155985 hartree
zpe.thermalcorrgfe: 0.096702 hartree
zpe.sumelectzpe: -1078.745191 hartree
zpe.sumelectthermal: -1078.729901 hartree
zpe.sumelectthermalent: -1078.728957 hartree
zpe.sumelectthermalfe: -1078.788240 hartree
dipole: -4.0535 -0.3489 -3.6213
dipole: 5.4467
quadrupole: -85.0421 -79.3690 -88.4421
quadrupole: -2.8888 -5.9000 1.6616
quadrupole: -0.7577 4.9154 -4.1577 -2.8888 -5.9000 1.6616
hfenergy: -1078.8849422 hartree
pointgroup: C01 [X(C4H8N1O7P1)]
dipole: 1.5467509 0.0510223 -1.4822125 debye
dipolederiv: 2.652035 0.0738419 0.3988904 0.1189673 1.8068658 0.1663048 0.2988654 -0.0367648 1.7116573 -1.627434 -0.4809786 -0.5307215 -0.4158913 -0.6837951 -0.1902751 -0.4563542 -0.1910741 -0.8361365 -1.2125092 -0.3065814 0.0729676 -0.6036727 -0.7286713 0.0307021 0.1564123 0.0218599 -0.3403482 -0.5126156 -0.0464528 0.1225788 -0.0910277 -0.2583202 0.1437525 -0.2104453 -0.164266 -0.921915 -0.9929733 0.0060427 -0.0968103 0.1256813 -0.5320802 0.1554444 -0.2916164 0.1353998 -0.3704931 -1.1748645 0.3697138 -0.072218 0.1707198 -0.8224463 -0.0511987 -0.0017085 -0.0552524 -0.6130132 -0.6876657 -0.0856588 -0.2646672 -0.0893059 -0.5840351 0.0446448 -0.4073103 0.0340734 -1.0155054 -0.7805921 -0.0191775 0.0250083 -0.0160358 -0.5430645 -0.0252951 -0.0270143 0.0327499 -0.5906337 -0.5402766 0.0046145 0.1901537 -0.0709423 -0.7211221 0.2945672 0.2308448 0.2081646 -0.4008942 0.4068305 0.1212262 -0.2878157 -0.0023412 0.2242525 -0.0731054 -0.3481556 -0.1149385 0.3937092 -0.2206589 -0.0806958 0.1637076 0.0038378 0.0136686 0.0060037 0.1541368 0.0879381 -0.1407389 1.3822711 0.311524 0.1436105 0.3827362 0.2453034 -0.1297371 0.7254796 0.3635297 1.4548337 1.5570807 0.2651957 0.1372571 0.3360236 0.9298812 -0.2860063 0.3156235 -0.2886336 0.2579375 0.0596375 -0.0454225 -0.0552453 -0.0585326 0.0328339 -0.0129152 -0.0673395 -0.020342 0.0292966 0.0760469 0.0459559 -0.0058448 0.030357 0.0214136 0.0519183 -0.0198059 0.0338941 0.0852056 -0.0481285 -0.0596835 -0.0565055 -0.0046574 0.0856406 -0.0165302 -0.0393765 -0.0379635 0.0068514 0.1175298 -0.0376928 0.0764144 0.0398702 0.2330182 -0.188464 0.0066461 -0.101643 0.1943096 0.1387511 -0.0303817 -0.0256686 0.0559769 0.3820631 -0.0085333 -0.0717099 -0.0277896 0.1166363 0.2249868 0.0295165 -0.0568496 0.0059009 0.2737233 0.0832179 -0.070627 0.0949835 0.3076275 0.9513686 -0.134625 0.0269725 0.0034244 0.2783773 0.0492266 0.0602663 0.0408077 0.3312242 0.2311805 0.0997192 0.0947858 0.0789117 0.3464934 -0.043722 0.0631886 -0.0147332 0.3403893 unknown
polarizability: 124.2570905|5.5800149|79.7212229|-1.0825356|-2.9852446|87.0899326 unknown
InChI: InChI=1S/C4H8NO7P/c5-2(4(7)8)1-3(6)12-13(9,10)11/h2,7,9-10H,1,5H2
charge 0 multiplicity 1
21 atoms
P  -2.550466 -0.360414 -0.141673
O  -1.140476 0.733771 -0.32607
O  0.989159 -1.736049 0.12934
O  -0.453654 0.738734 1.920592
O  3.207353 -1.12912 0.425032
O  -1.733964 -1.826033 0.006348
O  -3.012332 -0.333172 -1.792401
O  -3.703677 -0.012378 0.876454
N  2.889508 1.011117 -1.508083
C  1.731004 0.424629 -0.847145
C  1.077509 1.476412 0.116753
C  -0.217796 0.969868 0.723608
C  2.093825 -0.847994 -0.047606
H  0.972654 0.159197 -1.602658
H  0.880502 2.364957 -0.505293
H  1.771419 1.747141 0.930369
H  3.135757 0.588788 -2.406313
H  3.702761 1.150196 -0.900654
H  1.273824 -2.505097 0.696069
H  -0.723851 -1.787494 -0.052002
H  -3.916659 0.043442 -1.945166
