program: Gaussian 09
title: 000221071
version: EM64L-G09RevD.01
frameworkgroup: C1[X(C15H18O3)]
method: RPBEPBE
basis: SDD
operation: Freq
keyword: #pfreq=noraman
keyword: PBEPBE/SDD
title: #p freq=noraman PBEPBE/SDD
converged: YES YES NO NO
title: Mulliken charges:
elementType: O O O C C C C C C C C C C C C C C C H H H H H H H H H H H H H H H H H H
charge: -0.230969 -0.180906 -0.235698 -0.097336 -0.233535 0.143638 -0.497387 0.358966 -0.463230 -0.236603 0.157217 -0.740112 -0.180948 -0.001992 -0.720251 -0.391780 0.055993 -0.791343 0.262577 0.245191 0.234270 0.205118 0.214360 0.235014 0.253914 0.224631 0.252215 0.220683 0.237698 0.223154 0.217339 0.252000 0.257296 0.265861 0.250007 0.234948
chargesum: 0.00000
title: Mulliken charges with hydrogens summed into heavy atoms:
elementType: O O O C C C C C C C C C C C C C C C
charge: -0.230969 -0.180906 -0.235698 0.165241 0.011655 0.143638 -0.057999 0.358966 -0.013857 0.017311 0.157217 -0.042583 0.056750 -0.001992 -0.027758 -0.134484 0.055993 -0.040527
polarizability: 2.02889493e+02 1.14762548e+01 1.80990328e+02 -6.67167214e+00 -6.42462017e+00 1.14145594e+02
1716.lowfreq: -15.7701 -9.8533 -0.0005 0.0001 0.0003 3.9536 44.0097 53.0998 60.5320
frequency: 43.8416 53.0191 60.4264 78.7676 102.4459 159.4170 175.3930 191.5764 205.4594 210.1765 229.2975 242.1502 285.5541 292.2335 307.0465 331.3367 354.3983 367.0692 405.7204 426.0743 466.7779 479.3316 495.6084 520.9460 541.1820 564.1731 619.2606 623.3784 661.8241 685.0349 717.4608 722.8627 779.9381 816.5485 835.8649 852.3163 885.7892 898.2245 906.0989 939.4546 955.2019 985.0269 998.9775 1000.9419 1005.2335 1035.9280 1038.4816 1060.9880 1075.2074 1102.2046 1112.3722 1119.9253 1135.9694 1138.1296 1150.7653 1161.5566 1186.0995 1201.5949 1227.4667 1256.4431 1284.7281 1290.5946 1295.3535 1312.1152 1319.0550 1330.6896 1353.4136 1360.3185 1374.7791 1391.2503 1395.1320 1400.5083 1454.6928 1455.7158 1468.0111 1471.8577 1477.2766 1478.4450 1478.8584 1481.4178 1548.8664 1620.7967 1661.9628 1711.9448 2946.1698 2950.8093 2973.5989 2982.1072 2984.5766 2987.8737 2991.3100 3000.6082 3038.1732 3050.7155 3079.5238 3084.1038 3087.8021 3093.1265 3096.3912 3097.3603 3125.2432 3154.1935
redmass: 3.5216 1.1823 4.1684 4.2371 4.6160 3.1535 2.6598 1.0715 1.7010 4.4764 3.1762 1.9688 2.7227 3.2066 4.0405 2.6131 3.5603 4.0620 3.8782 3.6977 3.6128 3.4930 3.6931 3.5929 4.4056 5.0928 3.1209 5.8084 5.6825 4.2369 3.0919 4.2951 3.7471 2.5270 1.8967 1.9212 2.9856 2.2391 2.0945 2.4105 2.1811 2.3496 1.3947 1.9910 1.9943 1.5227 2.3477 2.5938 2.2788 1.7981 2.8170 2.3315 2.0333 1.6399 1.9855 2.1731 1.9275 1.5534 1.6029 1.4007 1.6679 1.4192 2.1562 1.4725 1.4960 1.4020 1.5352 1.6238 1.7746 1.3644 1.2118 1.2030 1.0744 1.0765 1.0879 1.0455 1.0615 1.0529 1.0574 1.0602 8.9776 8.8103 7.9022 12.3753 1.0804 1.0814 1.0785 1.0615 1.0508 1.0508 1.0359 1.0398 1.1000 1.1034 1.0990 1.0936 1.1004 1.0883 1.1000 1.0997 1.1000 1.0970
irintensity: 0.1830 0.6860 1.2805 3.6563 1.0718 0.3118 1.1550 0.3122 1.1406 1.6534 1.6066 0.5296 0.7417 3.6839 1.0425 0.9766 2.3280 11.1985 0.9205 0.2140 1.2068 5.3713 4.5278 2.5726 1.1315 7.6235 0.7504 3.4369 2.8196 1.3999 7.0466 2.0484 12.9408 3.2575 41.8255 5.0882 55.3036 3.6278 3.9233 66.7195 96.5360 33.7565 16.2831 62.4646 6.6972 2.0096 12.6561 15.8762 49.7868 16.9940 5.9040 28.4651 23.7743 0.8015 4.2527 19.2389 7.6213 5.5672 14.6597 3.5916 6.8046 1.4961 29.8199 3.3465 0.8827 1.0277 0.7487 4.4961 18.5219 15.6822 14.7231 36.5011 41.5297 4.8281 9.7831 9.9682 14.1926 15.0248 11.0780 7.9236 175.1592 9.9383 61.4974 347.2132 16.3023 2.4715 6.9526 32.0472 5.4677 63.1921 23.5180 13.2534 24.2535 44.5753 23.9425 12.3549 25.6483 18.6317 23.5152 14.8945 2.8727 15.0578
temp: 298.150 k
press: 1.00000 atm
elementType: 8 8 8 6 6 6 6 6 6 6 6 6 6 6 6 6 6 6 1 1 1 1 1 1 1 1 1 1 1 1 1 1 1 1 1 1
symmnumber: 1
zpe: 775320.5 jmol-1
zpe.correction: 0.295304 hartree
zpe.thermalcorrener: 0.312255 hartree
zpe.thermalcorrenthalpy: 0.313199 hartree
zpe.thermalcorrgfe: 0.251180 hartree
zpe.sumelectzpe: -806.713443 hartree
zpe.sumelectthermal: -806.696492 hartree
zpe.sumelectthermalent: -806.695548 hartree
zpe.sumelectthermalfe: -806.757567 hartree
dipole: -1.1890 -8.2063 0.1305
dipole: 8.2930
quadrupole: -124.4094 -113.9171 -104.6646
quadrupole: -0.9480 5.9235 -0.7034
quadrupole: -10.0790 0.4132 9.6658 -0.9480 5.9235 -0.7034
hfenergy: -807.0087468 hartree
pointgroup: C01 [X(C15H18O3)]
dipole: -0.4340568 -3.2321512 0.1001626 debye
polarizability: 202.7594534|11.6691972|181.0088176|-5.9704589|-7.4809235|114.2571437 unknown
InChI: InChI=1S/C15H18O3/c1-8-10-4-6-15(3)7-5-11(16)9(2)12(15)13(10)18-14(8)17/h5,7-8,10,13H,4,6H2,1-3H3
charge 0 multiplicity 1
36 atoms
O  -1.532594 1.33022 0.668835
O  -3.75779 1.927846 0.342612
O  3.588504 2.092376 -0.681251
C  -1.554511 -0.814599 -0.398499
C  -0.777606 0.041868 0.639924
C  1.288687 -1.33584 0.329059
C  -1.085948 -2.272108 -0.312378
C  0.697545 0.092671 0.307071
C  0.440313 -2.313499 -0.578927
C  -3.018149 -0.438093 -0.084823
C  -2.88578 1.04922 0.316447
C  1.322684 -1.885589 1.802495
C  2.715624 -1.387081 -0.167528
C  1.429435 1.21844 0.000235
C  -4.046134 -0.650661 -1.207873
C  3.440441 -0.286354 -0.499656
C  2.869584 1.074822 -0.40742
C  0.910673 2.645473 0.019496
H  -1.308985 -0.419399 -1.407003
H  -0.918792 -0.408693 1.645583
H  -1.603446 -2.900149 -1.061558
H  -1.329167 -2.693401 0.683478
H  0.827199 -3.340766 -0.435393
H  0.62272 -2.04306 -1.637389
H  -3.348797 -0.982344 0.827444
H  1.845508 -2.859254 1.827032
H  1.864488 -1.186577 2.46226
H  0.311013 -2.041377 2.214958
H  3.161748 -2.390564 -0.226821
H  -3.718092 -0.157427 -2.140453
H  -4.18703 -1.726289 -1.414256
H  -5.02075 -0.21796 -0.924385
H  4.480503 -0.351523 -0.838393
H  1.770574 3.333311 -0.020111
H  0.298418 2.851928 0.909418
H  0.272712 2.854532 -0.85853
