program: Gaussian 09
title: 000221066
version: EM64L-G09RevD.01
frameworkgroup: C1[X(C13H14O6)]
method: RPBEPBE
basis: SDD
operation: Freq
keyword: #pfreq=noraman
keyword: PBEPBE/SDD
title: #p freq=noraman PBEPBE/SDD
converged: YES YES NO NO
title: Mulliken charges:
elementType: O O O O O O C C C C C C C C C C C C C H H H H H H H H H H H H H H
charge: -0.258935 -0.262983 -0.270484 -0.228278 -0.242036 -0.231660 0.182348 0.181001 -0.325973 -0.366264 0.191607 -0.220633 -0.216932 -0.400812 0.155140 -0.261997 0.282861 -0.658338 -0.501407 0.276027 0.269693 0.238497 0.238672 0.269709 0.268525 0.236463 0.226708 0.219406 0.254358 0.230046 0.245145 0.249936 0.230587
chargesum: 0.00000
title: Mulliken charges with hydrogens summed into heavy atoms:
elementType: O O O O O O C C C C C C C C C C C C C
charge: -0.258935 -0.262983 -0.270484 -0.228278 -0.242036 -0.231660 0.182348 0.181001 -0.049946 -0.096570 0.191607 0.017864 0.021740 0.137422 0.155140 0.201174 0.282861 0.045472 0.224262
polarizability: 1.95463135e+02 -1.26250010e+01 1.80600214e+02 -1.69679358e+01 -4.45445671e-01 1.06576832e+02
1716.lowfreq: -5.8201 0.0002 0.0004 0.0007 2.5494 3.7586 11.1454 24.0529 27.2749
frequency: 10.5515 24.0301 27.2539 43.4877 59.0261 70.7165 73.9235 91.5143 96.9034 110.4574 136.1078 176.4866 199.6251 229.4784 239.7325 267.1407 283.7871 308.6052 318.4159 331.3873 383.8863 393.1299 410.9791 473.3800 520.8224 537.0628 552.5976 639.2327 649.8571 668.6468 681.2810 705.2047 748.7260 772.2310 787.7470 791.4421 796.2655 818.2730 881.6298 902.5043 919.8079 958.2617 978.2865 1003.9077 1005.1753 1011.9146 1035.4649 1043.9144 1082.0651 1096.4980 1111.4532 1117.8710 1148.8350 1151.8705 1156.8110 1178.3052 1225.1320 1231.5775 1252.4796 1276.5621 1281.9392 1334.1771 1356.8093 1381.2126 1393.5010 1418.2612 1420.3830 1430.7402 1451.9063 1458.5671 1463.7195 1464.2857 1477.9397 1484.0838 1579.4920 1602.7461 1625.7130 1641.4529 1659.9984 2995.1729 3005.0345 3029.8210 3032.5083 3090.6488 3096.9459 3108.7519 3116.2211 3123.1031 3139.1840 3150.0252 3154.2206 3168.4728 3180.2733
redmass: 4.7801 4.8269 5.5730 3.9031 2.0147 2.5232 4.0613 3.0480 3.4848 3.8832 4.6625 2.7388 3.2611 2.3757 4.3087 2.7313 3.6841 4.8563 4.5071 6.5738 4.6776 4.7926 3.7753 4.4869 4.5788 3.8385 4.2757 6.3205 5.0811 6.2159 6.2141 4.0234 5.4511 4.9640 1.5387 2.3457 2.6014 2.2240 4.0019 1.5692 5.3393 4.6496 1.4515 2.0194 1.5215 2.9967 3.1819 6.1709 3.4331 2.1887 1.4338 1.6436 3.8894 1.4959 1.6767 1.0675 1.2487 2.9248 2.9271 1.1199 1.5702 1.3679 1.3364 10.7563 1.2284 1.2207 1.0995 2.1004 1.0517 1.0901 1.0516 1.0443 2.5980 1.0518 7.2002 6.3027 10.2132 10.8764 9.8430 1.0362 1.0292 1.0602 1.0600 1.0973 1.1031 1.1047 1.1018 1.1063 1.0864 1.1047 1.0912 1.0964 1.0983
irintensity: 0.5401 0.6309 0.6603 1.2291 1.4554 2.8752 0.4540 3.2867 1.0535 1.8912 5.1700 2.6440 0.6102 2.7501 3.9375 3.5718 9.0259 27.2710 9.7312 0.5127 21.6827 1.4635 2.2956 3.6594 0.3045 3.8992 3.6067 4.4757 8.7025 6.0439 2.8167 75.7761 32.2387 5.8127 34.6331 4.0657 4.3156 6.1654 6.2085 1.8235 6.7015 13.8938 1.4667 14.1367 7.4001 28.1907 59.7628 355.2653 199.3327 30.0701 23.6325 48.2936 273.2594 27.9585 24.8104 0.1849 46.1062 63.7025 228.6122 3.9941 27.8941 58.2307 6.7165 9.5107 22.3801 27.1144 55.7834 8.9980 14.6141 11.1219 11.3164 13.6315 14.2282 12.9532 27.0676 30.2696 156.2155 199.0387 115.5583 15.9059 32.6115 29.9247 22.9565 32.5142 0.7973 20.9888 1.1990 31.1673 2.3980 14.3438 8.1416 11.1277 10.7420
temp: 298.150 k
press: 1.00000 atm
elementType: 8 8 8 8 8 8 6 6 6 6 6 6 6 6 6 6 6 6 6 1 1 1 1 1 1 1 1 1 1 1 1 1 1
symmnumber: 1
zpe: 655057.3 jmol-1
zpe.correction: 0.249498 hartree
zpe.thermalcorrener: 0.269085 hartree
zpe.thermalcorrenthalpy: 0.270029 hartree
zpe.thermalcorrgfe: 0.197065 hartree
zpe.sumelectzpe: -953.718194 hartree
zpe.sumelectthermal: -953.698608 hartree
zpe.sumelectthermalent: -953.697663 hartree
zpe.sumelectthermalfe: -953.770628 hartree
dipole: 2.8042 0.4393 -2.2932
dipole: 3.6490
quadrupole: -89.6464 -95.4687 -114.5667
quadrupole: -6.8916 5.7677 4.2968
quadrupole: 10.2475 4.4252 -14.6727 -6.8916 5.7677 4.2968
hfenergy: -953.9676925 hartree
pointgroup: C01 [X(C13H14O6)]
dipole: 1.0436852 0.1784075 -0.9695102 debye
polarizability: 193.1496239|-12.5683149|180.4501408|-22.3726894|0.1627306|109.0404163 unknown
InChI: InChI=1S/C13H14O6/c1-3-18-11(14)8-19-13(16)10-7-5-4-6-9(10)12(15)17-2/h4-7H,3,8H2,1-2H3
charge 0 multiplicity 1
33 atoms
O  0.819017 0.067927 -1.478502
O  4.399286 -0.498055 -0.987308
O  -2.240188 -1.997029 -0.55701
O  0.340774 -1.183082 0.435756
O  -3.548167 -1.612695 1.334135
O  2.983565 1.109619 -0.042946
C  -1.122835 0.675305 -0.229294
C  -2.394629 0.248596 0.25152
C  -0.889363 2.054602 -0.457194
C  -3.391072 1.213179 0.536004
C  0.036326 -0.261517 -0.351235
C  -1.898109 3.005361 -0.193264
C  -3.147895 2.585567 0.316073
C  2.103513 -0.63054 -1.576995
C  -2.777574 -1.187733 0.440485
C  5.571625 0.064298 -0.237056
C  3.171095 0.114384 -0.771978
C  5.660615 -0.553347 1.16006
C  -2.486948 -3.449721 -0.40705
H  0.096303 2.368103 -0.811827
H  -4.355182 0.867692 0.922409
H  -1.702445 4.068503 -0.368079
H  -3.929096 3.320433 0.537115
H  2.020145 -1.664206 -1.196037
H  2.366881 -0.642826 -2.645428
H  5.458576 1.161567 -0.189216
H  6.432133 -0.204452 -0.869665
H  6.571182 -0.186709 1.669206
H  4.787719 -0.271031 1.771944
H  5.716767 -1.653829 1.102668
H  -3.563987 -3.644307 -0.272055
H  -1.93145 -3.829432 0.466852
H  -2.112284 -3.896825 -1.338186
