program: Gaussian 09
title: 000221054
version: EM64L-G09RevD.01
frameworkgroup: C1[X(C12H16O3)]
method: RPBEPBE
basis: SDD
operation: Freq
keyword: #pfreq=noraman
keyword: PBEPBE/SDD
title: #p freq=noraman PBEPBE/SDD
converged: YES YES NO NO
title: Mulliken charges:
elementType: O O O C C C C C C C C C C C C H H H H H H H H H H H H H H H H
charge: -0.206538 -0.140912 -0.154211 -0.291801 -0.548624 0.470599 -0.333208 -0.559703 -0.557717 0.176416 0.204757 -0.838697 0.582305 -0.829877 -0.744919 0.273434 0.278975 0.273626 0.236982 0.212327 0.222395 0.218273 0.213849 0.228616 0.215101 0.261011 0.214625 0.232530 0.250932 0.212970 0.226483
chargesum: 0.00000
title: Mulliken charges with hydrogens summed into heavy atoms:
elementType: O O O C C C C C C C C C C C C
charge: -0.206538 -0.140912 -0.154211 -0.018367 0.003977 0.470599 -0.096226 -0.124981 -0.125595 0.176416 0.204757 -0.133969 0.582305 -0.131790 -0.305465
polarizability: 1.71513577e+02 -1.28890003e+00 1.24708777e+02 -1.19180949e+01 3.01351717e+00 1.12863263e+02
1716.lowfreq: -5.2843 -0.0009 -0.0006 0.0002 8.6578 12.8260 22.8582 32.2316 51.7157
frequency: 19.2675 32.1363 51.6608 53.4244 80.6785 98.8060 131.1572 145.3951 181.6183 195.3856 226.6852 250.3723 271.3177 357.4057 376.7164 392.2541 397.4516 421.8966 446.4256 491.3818 513.4687 557.7782 573.8496 588.3616 613.0944 675.8422 697.0217 754.3070 773.5189 800.7964 820.4841 852.5700 878.4858 921.3109 926.1258 941.9885 968.2578 994.0720 997.0043 1027.5071 1030.9343 1046.3443 1049.7848 1057.6511 1105.4303 1136.1384 1153.1675 1168.5395 1202.3384 1212.0449 1245.0495 1260.8425 1287.5340 1296.0249 1321.6826 1345.0440 1376.4171 1394.1917 1397.9684 1428.7538 1441.1366 1454.2250 1460.0156 1468.9619 1474.0242 1478.2873 1482.0006 1667.5999 1683.7801 1703.8647 1771.3455 2956.6439 2968.0859 2971.2947 2976.5860 3007.3430 3018.7595 3026.8783 3045.4388 3048.2718 3052.1320 3083.8902 3085.0418 3088.2859 3089.5317 3099.3486 3187.5148
redmass: 6.5268 5.2975 3.7658 3.4220 2.9607 3.7521 12.4950 1.8794 1.3687 1.2063 2.3909 3.6552 3.2551 2.8221 5.2172 2.9743 2.3904 2.2088 2.5900 2.7873 2.9888 3.7531 2.5245 8.1299 4.1894 6.2998 1.1322 2.5937 3.9558 3.8292 5.1110 1.5945 2.5068 1.8474 1.6638 1.3629 1.5074 1.9764 2.0039 2.1999 1.6487 2.5053 1.7316 1.8259 6.9839 2.1168 1.5088 1.3366 1.2630 1.4353 1.4713 1.2992 1.7003 2.4811 1.3315 1.6543 1.3299 1.2402 1.2677 1.1738 1.0777 1.0775 1.0835 1.0519 1.0647 1.0610 1.0831 4.9786 7.2498 12.1116 12.8361 1.0629 1.0445 1.0568 1.0392 1.0813 1.0653 1.0964 1.0965 1.0966 1.0969 1.0638 1.0900 1.0959 1.0976 1.0980 1.1135
irintensity: 0.4675 0.2990 1.1723 4.9489 0.4058 1.6164 1.5613 1.0107 0.8298 1.9048 0.2563 3.9277 4.2985 0.3433 7.4070 1.8669 2.1891 2.1989 6.5326 9.2901 2.4473 25.4056 2.0663 7.8169 22.8497 43.8134 1.0420 1.0971 3.2170 75.4402 244.5187 5.6126 61.5057 1.1828 5.4020 78.4084 0.8685 59.4884 59.8637 22.6882 7.6081 36.9031 4.4008 15.9675 141.0749 17.6584 24.6583 4.2804 1.1371 1.5597 14.1982 0.2262 1.0692 3.2156 1.1007 2.6379 2.8367 12.4197 37.0038 0.9584 18.9424 7.3047 13.3792 21.9816 27.0109 2.2234 2.7042 22.3965 69.0400 465.6642 110.3947 10.4802 28.3954 65.2981 21.7762 7.2346 4.1665 0.2898 24.5028 51.5530 12.4320 8.6609 8.5613 44.4191 21.6496 4.6777 23.6089
temp: 298.150 k
press: 1.00000 atm
elementType: 8 8 8 6 6 6 6 6 6 6 6 6 6 6 6 1 1 1 1 1 1 1 1 1 1 1 1 1 1 1 1
symmnumber: 1
zpe: 662751.8 jmol-1
zpe.correction: 0.252429 hartree
zpe.thermalcorrener: 0.268520 hartree
zpe.thermalcorrenthalpy: 0.269464 hartree
zpe.thermalcorrgfe: 0.206867 hartree
zpe.sumelectzpe: -691.378171 hartree
zpe.sumelectthermal: -691.362080 hartree
zpe.sumelectthermalent: -691.361136 hartree
zpe.sumelectthermalfe: -691.423733 hartree
dipole: -4.0100 -4.6622 -0.4981
dipole: 6.1697
quadrupole: -114.6659 -93.8899 -84.2219
quadrupole: -4.5870 1.5842 -2.6883
quadrupole: -17.0733 3.7027 13.3706 -4.5870 1.5842 -2.6883
hfenergy: -691.6306 hartree
pointgroup: C01 [X(C12H16O3)]
dipole: -1.5413256 -1.8680003 -0.1637597 debye
polarizability: 171.1917705|-0.3316627|124.7049055|-12.8132641|2.7035007|113.1889413 unknown
InChI: InChI=1S/C12H16O3/c1-8(2)4-5-9(3)6-10-7-11(13)15-12(10)14/h6,10H,1,4-5,7H2,2-3H3
charge 0 multiplicity 1
31 atoms
O  3.18975 1.261775 0.093656
O  1.052748 2.1768 0.326251
O  4.966658 -0.215305 -0.251226
C  1.346203 -0.32333 0.258129
C  2.60626 -1.050023 -0.28326
C  -1.04765 -1.229307 -0.034905
C  0.06224 -0.585824 -0.497003
C  -2.254421 -1.399254 -0.952141
C  -3.601604 -0.876274 -0.359666
C  1.748275 1.166024 0.234644
C  3.749952 -0.048131 -0.153789
C  -1.190437 -1.814419 1.357573
C  -3.596092 0.59058 0.059674
C  -3.146808 1.602739 -0.979407
C  -3.996536 0.967622 1.303673
H  1.212664 -0.572706 1.328534
H  2.489273 -1.307043 -1.352659
H  2.852093 -1.981434 0.250145
H  0.051455 -0.20297 -1.528768
H  -2.392992 -2.47821 -1.176545
H  -2.057505 -0.898295 -1.918397
H  -3.901542 -1.504891 0.499564
H  -4.375234 -1.026018 -1.142481
H  -1.589721 -2.845524 1.304794
H  -0.241472 -1.851342 1.918039
H  -1.907625 -1.218584 1.952926
H  -3.682197 1.456608 -1.938342
H  -3.323773 2.63632 -0.637497
H  -2.064412 1.503349 -1.187622
H  -4.321062 0.233907 2.052503
H  -4.017888 2.020658 1.607001
