program: Gaussian 09
title: 000221043
version: EM64L-G09RevD.01
frameworkgroup: C1[X(C9H7NO2S)]
method: RPBEPBE
basis: SDD
operation: Freq
keyword: #p
keyword: freq=noraman
keyword: PBEPBE/SDD
title: #p freq=noraman PBEPBE/SDD
converged: YES YES NO NO
title: Mulliken charges:
elementType: S O O N C C C C C C C C C H H H H H H H
charge: 0.249392 -0.186666 -0.139921 -0.295537 0.503593 0.263809 -0.783437 -0.106916 -0.335304 -0.336613 -0.215822 -0.214363 -0.235733 0.307751 0.305502 0.258678 0.260575 0.233220 0.233641 0.234151
chargesum: 0.00000
title: Mulliken charges with hydrogens summed into heavy atoms:
elementType: S O O N C C C C C C C C C
charge: 0.249392 -0.186666 -0.139921 -0.295537 0.503593 0.263809 -0.170184 -0.106916 -0.076627 -0.076038 0.017397 0.019278 -0.001581
polarizability: 1.71455156e+02 -4.72276297e+00 1.22998206e+02 -2.01888392e+00 -8.87188536e+00 6.87488406e+01
1716.lowfreq: -10.7157 -8.0366 -0.0018 -0.0017 -0.0006 3.6158 51.1835 65.4344 96.4151
frequency: 51.1769 65.4321 96.4149 110.7757 163.5658 265.0138 271.5979 375.5517 383.3791 404.8885 449.4313 488.3050 521.4566 567.4691 571.7320 610.8796 634.4350 646.4798 693.4393 735.6062 763.5395 799.8768 838.1351 900.5311 916.4926 959.5509 971.4289 991.0797 996.0889 1027.7906 1080.1221 1112.5431 1128.0694 1168.6873 1176.0279 1192.4558 1238.2972 1305.5726 1324.9988 1386.2001 1425.5820 1443.3574 1483.2725 1598.6929 1608.6497 1625.4415 1685.3861 3052.2364 3123.6990 3135.7801 3148.3552 3162.9857 3177.3180 3183.3763
redmass: 4.5628 7.7972 6.2118 3.4623 6.3288 8.6870 5.2978 16.2733 6.2402 2.8147 13.5068 4.3935 5.2523 3.7406 12.0040 6.6926 6.6658 6.7665 1.9681 4.7902 1.9898 5.3663 1.2577 1.6475 1.4650 5.8388 1.3960 6.1273 1.3271 2.1938 2.0557 3.5317 1.1476 4.3297 1.0500 1.1671 1.3090 5.6889 1.3318 10.0279 1.0804 2.2725 2.2962 6.6171 6.1013 12.3214 12.7882 1.0572 1.1065 1.0856 1.0900 1.0951 1.0961 1.0990
irintensity: 0.2569 4.4457 3.3228 6.2268 0.7375 8.7241 0.7341 1.3079 0.2435 0.5006 8.7139 4.0918 33.4794 0.9477 5.9185 1.1628 2.0964 34.4758 41.8828 5.0493 60.4085 55.8075 1.1476 7.6499 3.4693 11.0773 0.1216 1.2975 0.4738 5.2593 38.0409 138.8564 0.1473 73.6887 0.0318 2.3301 19.3860 258.6885 4.3525 1.8661 12.8676 12.7350 58.7049 21.6121 6.6618 460.1764 74.8742 4.2370 0.0743 0.0297 12.6615 28.6881 6.8082 1.6662
temp: 298.150 k
press: 1.00000 atm
elementType: 16 8 8 7 6 6 6 6 6 6 6 6 6 1 1 1 1 1 1 1
symmnumber: 1
zpe: 372269.8 jmol-1
zpe.correction: 0.141790 hartree
zpe.thermalcorrener: 0.152663 hartree
zpe.thermalcorrenthalpy: 0.153607 hartree
zpe.thermalcorrgfe: 0.103978 hartree
zpe.sumelectzpe: -949.521498 hartree
zpe.sumelectthermal: -949.510625 hartree
zpe.sumelectthermalent: -949.509681 hartree
zpe.sumelectthermalfe: -949.559310 hartree
dipole: 0.3014 1.2519 0.2868
dipole: 1.3192
quadrupole: -67.5958 -91.9007 -81.3124
quadrupole: -6.8331 -1.7050 -8.2827
quadrupole: 12.6739 -11.6311 -1.0428 -6.8331 -1.7050 -8.2827
hfenergy: -949.6632881 hartree
pointgroup: C01 [X(C9H7N1O2S1)]
dipole: -0.0901953 -0.4884294 0.1505749 debye
dipolederiv: -0.7237661 0.173645 -0.0455748 0.1352037 -0.0803438 0.0182448 -0.0541506 0.0037654 -0.0454588 -0.5050753 -0.2707397 0.1126218 0.0368169 -0.9869185 0.2315251 -0.038711 0.220225 -0.3722086 -0.6893103 0.2721068 -0.0997528 0.2466037 -1.0064421 0.2542134 -0.0367099 0.2266426 -0.329626 -1.1707993 0.0692673 0.0031174 -0.1647809 -1.3059885 0.3494 0.0641006 0.3265378 -0.2219487 0.8650538 -0.0065266 -0.0189918 -0.0381801 0.0131992 0.1048319 -0.0195361 0.0535691 0.0995295 0.8451952 -0.0917739 0.0038088 -0.4235289 1.4077585 -0.4137931 0.0501541 -0.3572353 0.3154559 -0.4156592 -0.0713315 0.037265 0.0746203 0.2585109 -0.0481756 0.033644 -0.0523849 0.1063704 1.7429753 -0.0363051 -0.006842 0.1071893 1.5094693 -0.4880501 -0.0036904 -0.4063095 0.293312 -0.1269023 -0.0899726 -0.03071 -0.0600166 -0.0199947 0.0486644 0.0444163 0.013752 -0.0877138 -0.0970259 0.0915988 0.0316023 0.0766257 -0.0158046 0.0440715 -0.0214076 0.0078632 -0.0874625 -0.0208421 0.1166857 0.0505281 0.0767464 0.0246459 0.1040639 0.0468626 0.0862698 -0.0889444 -0.0340462 -0.1079821 -0.0535807 -0.0786336 0.0256125 0.1078693 -0.0668363 0.0963948 -0.0833059 0.0934924 0.0021811 -0.0061926 0.0051553 -0.0595543 0.0406166 -0.0019284 0.056595 -0.1250063 0.1021392 -0.0275405 -0.0194593 0.0024186 0.0377719 0.0520017 -0.0556885 0.0548292 0.0103338 0.0909963 -0.0163589 0.0277569 0.0180151 -0.0185371 -0.0352173 0.0482608 -0.0399173 0.0619844 0.06744 0.0666658 0.043488 0.0643101 0.0502983 -0.0724848 0.0481585 -0.0401302 0.104502 0.0630394 -0.0693904 -0.0393488 -0.0724744 0.0522794 -0.0679215 -0.0480801 -0.0371724 0.1097834 0.0159249 -0.0653382 -0.0403724 -0.0829827 0.0017711 -0.0968323 -0.0481995 -0.091874 0.1006144 0.0233676 0.061417 0.0438243 0.0786769 0.0009767 -0.1003778 0.0509184 -0.095 0.0962839 -0.1261974 -0.0003081 0.0068123 -0.0017848 0.1112901 -0.0326502 0.008423 -0.0264202 0.1435052 unknown
polarizability: 171.7937961|-2.1265707|123.6488966|-1.7266781|5.1719071|67.7595107 unknown
InChI: InChI=1S/C9H7NO2S/c11-8-6-13-9(12)10(8)7-4-2-1-3-5-7/h1-5H,6H2
charge 0 multiplicity 1
20 atoms
S  3.339877 0.860672 -0.381575
O  1.054715 -2.26488 0.573679
O  1.012864 2.271707 -0.749106
N  0.790672 -0.000565 -0.071578
C  -0.662682 0.003156 -0.035684
C  1.546004 -1.161337 0.241677
C  3.050563 -0.923187 0.135077
C  1.510065 1.17837 -0.436058
C  -1.377154 -1.039298 -0.669254
C  -1.342439 1.04521 0.635536
C  -2.787735 -1.036052 -0.623749
C  -2.753281 1.04276 0.665057
C  -3.479306 0.003463 0.039335
H  3.520704 -1.113423 1.112145
H  3.479923 -1.604988 -0.615297
H  -0.841882 -1.844927 -1.178184
H  -0.780636 1.850501 1.116276
H  -3.34387 -1.844506 -1.109825
H  -3.282609 1.851871 1.179095
H  -4.574194 0.004052 0.067735
