program: Gaussian 09
title: 000221036
version: EM64L-G09RevD.01
frameworkgroup: C1[X(C20H18O2)]
method: RPBEPBE
basis: SDD
operation: Freq
keyword: #pfreq=noraman
keyword: PBEPBE/SDD
title: #p freq=noraman PBEPBE/SDD
converged: YES YES NO NO
title: Mulliken charges:
elementType: O O C C C C C C C C C C C C C C C C C C C C H H H H H H H H H H H H H H H H H H
charge: -0.272717 -0.265984 0.513884 -0.508775 0.329923 -0.420515 -0.281842 -0.371068 -0.225960 0.482731 -0.384551 -0.391464 -0.307171 -0.310649 -0.236269 -0.237019 0.153667 -0.210254 -0.238368 -0.334540 -0.159525 -0.536995 0.250935 0.240188 0.268489 0.244980 0.226763 0.226160 0.232477 0.211776 0.228272 0.228401 0.230438 0.222573 0.232471 0.264928 0.214508 0.221764 0.221799 0.246537
chargesum: 0.00000
title: Mulliken charges with hydrogens summed into heavy atoms:
elementType: O O C C C C C C C C C C C C C C C C C C C C
charge: -0.272717 -0.265984 0.513884 -0.257840 0.329923 -0.180327 -0.013353 -0.126087 0.000804 0.482731 -0.158391 -0.158987 -0.095395 -0.082376 -0.007868 -0.006581 0.153667 0.012320 -0.005896 -0.120032 0.105403 0.153105
polarizability: 6.98429833e+02 -2.38947605e+01 2.35401937e+02 7.45450146e-02 -2.09431838e-02 9.08491168e+01
1716.lowfreq: -0.0010 0.0009 0.0012 2.5575 2.8709 8.1378 19.8202 22.2222 22.7191
frequency: 19.8156 21.9528 22.6988 54.5681 65.0776 68.4415 79.3498 110.6230 132.2441 153.1228 172.9767 200.0941 207.0153 210.4933 257.8738 258.4984 269.6811 287.8608 317.2197 329.5584 373.1349 403.0118 426.2708 449.8275 482.4731 509.4961 513.8975 539.5311 571.1782 583.7977 614.6649 616.9788 671.7383 692.8267 702.8164 704.6946 763.7617 767.8293 787.8370 834.9321 842.8078 850.5047 880.3114 889.1870 899.5568 908.5332 915.6508 929.5460 956.8486 957.2730 972.0525 979.6497 982.3290 987.4047 997.4956 1014.1117 1019.1045 1024.5089 1026.0221 1082.2564 1093.0477 1102.5265 1111.2412 1146.8432 1167.5910 1173.5100 1184.9217 1190.6702 1191.5700 1224.0624 1230.2654 1241.0583 1278.7822 1287.0362 1304.0932 1311.8197 1318.8532 1332.6145 1354.1007 1389.4844 1393.9445 1431.2166 1441.1515 1449.5353 1467.3804 1473.7004 1475.9421 1483.7548 1507.5085 1577.6264 1578.2803 1601.1860 1610.7072 1615.7134 1624.5217 1644.7921 2960.1002 3048.2426 3087.9558 3092.9113 3096.1302 3103.4192 3109.0142 3117.8959 3121.6282 3126.0237 3128.6201 3132.1726 3141.0577 3151.3467 3151.9479 3160.8319 3167.1178 3170.5452
redmass: 3.7834 5.1627 5.6615 5.0180 4.1194 5.1585 3.3795 4.3192 6.3285 3.1958 5.4474 2.1335 1.7226 6.5084 3.8271 1.9049 2.8753 2.7201 5.3196 3.0027 5.0478 2.7771 5.2211 2.8051 4.6172 2.7468 4.4114 5.3158 5.7045 3.9728 6.1578 5.6056 2.8244 1.7182 6.4592 2.1638 5.1201 1.7367 1.5305 4.5628 1.4299 1.4152 1.5173 1.6341 1.6523 4.8929 1.7284 1.7468 1.2508 4.7282 1.3262 1.3948 6.0326 6.1554 1.3279 1.1907 3.0653 1.1323 2.1851 1.6986 1.8973 1.9508 1.2593 1.5462 1.4793 1.0870 1.7726 1.2726 1.1348 1.6471 1.9013 1.6352 1.6053 1.6595 1.4407 1.5943 1.3917 1.5022 2.0209 5.6227 7.9814 1.3457 2.3306 2.1405 1.0503 1.6148 1.4480 2.3018 9.2916 5.6287 5.5935 5.4922 5.6604 6.4032 5.3588 5.5053 1.0329 1.1040 1.0914 1.0912 1.0900 1.0912 1.0869 1.0896 1.0870 1.0993 1.0862 1.0865 1.0913 1.0932 1.0961 1.0913 1.1015 1.0969
irintensity: 0.1204 1.1899 0.4843 1.9229 0.0172 0.2476 4.1120 4.0950 0.3772 0.0000 0.2115 1.9631 0.0022 2.9275 4.1765 0.0016 1.1814 0.8902 4.9974 0.1294 28.9695 0.0058 3.2892 5.2302 10.3731 10.2842 0.0370 10.6464 32.3255 0.1441 3.5597 7.0409 8.6937 63.0614 19.2970 3.4545 6.6175 69.5512 37.5322 4.1017 2.0694 2.1457 0.9165 25.4621 2.5500 11.2245 15.6340 1.9675 11.6010 5.9805 0.1384 0.1783 1.8128 1.0627 0.6646 9.1199 59.4873 130.6167 6.3230 13.7713 30.8423 414.8175 0.2246 36.6539 57.7177 0.3923 1.7842 7.8690 15.3709 30.4296 223.6553 64.2109 59.7402 52.8550 0.2026 1.1931 1.3022 104.6248 191.6880 4.3697 70.9533 49.2445 12.9253 96.9197 13.4509 24.4840 67.7292 0.2543 143.4822 53.0191 11.2949 425.3282 81.7795 32.8372 721.3409 24.2127 85.5936 48.8853 4.2173 5.4450 0.2066 1.6640 28.3858 27.1858 9.4541 23.2442 1.5377 6.5066 6.3587 19.0053 39.2804 1.8032 48.0323 24.6268
temp: 298.150 k
press: 1.00000 atm
elementType: 8 8 6 6 6 6 6 6 6 6 6 6 6 6 6 6 6 6 6 6 6 6 1 1 1 1 1 1 1 1 1 1 1 1 1 1 1 1 1 1
symmnumber: 1
zpe: 834054.5 jmol-1
zpe.correction: 0.317675 hartree
zpe.thermalcorrener: 0.338092 hartree
zpe.thermalcorrenthalpy: 0.339036 hartree
zpe.thermalcorrgfe: 0.265205 hartree
zpe.sumelectzpe: -921.785315 hartree
zpe.sumelectthermal: -921.764898 hartree
zpe.sumelectthermalent: -921.763954 hartree
zpe.sumelectthermalfe: -921.837785 hartree
dipole: 1.0725 3.5920 0.0095
dipole: 3.7487
quadrupole: -61.6261 -122.9985 -138.7836
quadrupole: 4.9829 0.0435 -0.0036
quadrupole: 46.1767 -15.1958 -30.9809 4.9829 0.0435 -0.0036
hfenergy: -922.1029901 hartree
pointgroup: C01 [X(C20H18O2)]
dipole: -0.4025798 -1.41851 0.0302707 debye
polarizability: 698.9968788|-17.5530156|234.7860646|0.0059959|-2.6468535|90.8979439 unknown
InChI: InChI=1S/C20H18O2/c1-22-20-13-7-11-18(16-20)14-15-19(21)12-6-5-10-17-8-3-2-4-9-17/h2-16H,1H3
charge 0 multiplicity 1
40 atoms
O  -6.101316 -2.503784 0.056201
O  -0.345001 2.50654 -0.037189
C  -4.304351 0.726851 0.000438
C  -4.601123 -0.661236 0.022533
C  -5.939974 -1.10935 0.033721
C  -5.38641 1.658476 -0.010654
C  -2.932182 1.249933 -0.011025
C  -7.012703 -0.1790 0.022802
C  -6.717824 1.204135 0.000456
C  5.793572 -0.02516 0.009508
C  5.924405 -1.446626 0.039956
C  6.986166 0.757563 -0.007321
C  -1.760669 0.540104 -0.001212
C  4.499123 0.663717 -0.004622
C  7.194858 -2.052611 0.052985
C  8.258204 0.150402 0.00556
C  -0.442177 1.228544 -0.014666
C  3.244857 0.091141 0.005287
C  8.369211 -1.259224 0.035918
C  0.75492 0.353907 0.000197
C  2.030139 0.873614 -0.009156
C  -7.467775 -3.031592 0.068891
H  -3.807966 -1.414858 0.031694
H  -5.168988 2.73224 -0.02768
H  -2.823246 2.344933 -0.029477
H  -8.054131 -0.51349 0.031278
H  -7.5412 1.926625 -0.008074
H  5.029547 -2.078312 0.053694
H  6.904275 1.851388 -0.030666
H  -1.753119 -0.55757 0.017242
H  4.547876 1.763164 -0.025176
H  7.276224 -3.145085 0.076621
H  9.160212 0.771948 -0.007891
H  3.136169 -1.002451 0.025379
H  9.355692 -1.735503 0.046266
H  2.115133 1.970867 -0.028679
H  0.597272 -0.733549 0.019624
H  -8.025831 -2.729859 -0.838894
H  -8.019384 -2.702534 0.971102
H  -7.351587 -4.125097 0.085032
