program: Gaussian 09
title: 000221357
version: EM64L-G09RevD.01
frameworkgroup: C1[X(C21H33N3O)]
method: RPBEPBE
basis: SDD
operation: Freq
keyword: #p
keyword: freq=noraman
keyword: PBEPBE/SDD
title: #p freq=noraman PBEPBE/SDD
converged: YES YES NO NO
title: Mulliken charges:
elementType: O N N N C C C C C C C C C C C C C C C C C C C C C H H H H H H H H H H H H H H H H H H H H H H H H H H H H H H H H H
charge: -0.266204 -0.117592 -0.410447 -0.063184 -0.366113 -0.366150 -0.363444 -0.446833 -0.363555 -0.359234 -0.347561 -0.333107 -0.330860 -0.704829 -0.695910 0.400075 -0.245846 -0.541423 0.542397 0.346130 -0.619821 -0.341416 -0.184367 -0.392191 -0.542967 0.197719 0.223277 0.193542 0.198398 0.191538 0.197448 0.200008 0.207327 0.186170 0.209485 0.188091 0.189387 0.214386 0.221172 0.183114 0.204425 0.183814 0.212148 0.328697 0.207332 0.238531 0.200798 0.213257 0.210622 0.206140 0.256531 0.253808 0.243900 0.223955 0.237011 0.229831 0.219060 0.243525
chargesum: 0.00000
title: Mulliken charges with hydrogens summed into heavy atoms:
elementType: O N N N C C C C C C C C C C C C C C C C C C C C C
charge: -0.266204 -0.117592 -0.081750 -0.063184 0.054883 0.025789 0.025542 -0.039498 0.032100 0.018244 0.087998 0.054432 0.065103 -0.058168 -0.065891 0.400075 -0.245846 -0.284891 0.542397 0.346130 -0.366013 -0.097517 0.039587 -0.155179 0.149450
polarizability: 3.16705471e+02 2.11798436e+01 2.96098053e+02 -3.34256485e+01 -3.08238195e+00 1.85327104e+02
1716.lowfreq: -6.1610 -4.5608 -0.0006 -0.0004 0.0000 4.0702 15.9728 17.8990 23.5726
frequency: 15.6944 17.3941 23.4554 35.7555 38.2470 57.3327 69.3817 74.2233 84.6708 89.2865 100.6579 109.8667 124.4517 140.8037 164.0192 184.7094 201.2089 209.4342 212.4369 232.4189 241.2789 254.1513 256.8166 268.7491 290.8064 296.6691 312.8562 314.7461 345.8851 370.5678 380.1961 401.3256 433.0370 438.1383 489.6918 509.1821 523.3410 532.9344 533.2131 591.0717 618.3866 619.7121 635.9538 644.8585 672.1820 691.1531 741.5717 753.5838 766.4372 783.2738 793.5359 809.4565 816.7444 822.0840 829.2546 850.6493 856.9345 870.5704 871.5547 894.5873 920.8122 925.8459 938.5524 943.3116 952.9509 981.1037 987.4740 1001.9179 1013.5718 1036.5604 1039.4850 1048.4949 1068.1500 1075.5769 1086.2168 1099.5717 1099.7308 1110.5989 1112.8830 1118.6308 1122.3967 1136.8651 1156.8474 1165.0173 1177.5351 1182.1639 1208.5428 1223.0737 1227.0426 1232.8393 1236.3965 1250.8182 1264.9078 1271.1149 1283.9209 1287.2396 1294.0940 1300.4786 1305.0473 1307.6134 1345.6965 1348.3783 1350.3069 1354.0374 1355.0876 1364.4254 1369.2932 1376.6653 1379.1537 1388.7052 1390.5648 1411.3299 1422.1173 1443.1694 1453.7652 1455.7140 1459.3428 1461.1251 1467.3358 1468.8228 1472.8538 1473.8967 1475.0688 1476.2215 1476.9564 1477.7546 1479.1807 1481.2644 1486.8189 1488.7936 1489.8924 1523.6161 1573.4145 1592.7582 1625.1964 2856.5373 2865.8783 2876.6242 2925.6051 2959.5930 2961.2003 2963.0434 2967.4199 2968.6549 2969.7035 2970.2531 2976.1102 2993.9374 3003.8162 3005.1031 3016.1613 3019.7275 3029.7001 3034.5513 3036.0264 3047.7033 3049.7724 3060.2137 3066.6994 3067.5485 3068.5043 3120.1083 3124.1199 3132.7815 3162.3120 3163.6786 3170.8533 3454.1184
redmass: 4.1650 4.4240 4.6615 3.2204 3.7148 3.8339 3.2585 2.9099 2.0031 2.7080 1.8417 2.6831 4.0642 3.7456 3.0197 3.7609 2.0693 2.8652 2.6308 1.1846 1.1749 2.2655 1.7842 2.0539 2.4174 3.2689 4.1508 2.4799 2.7670 4.0456 2.2376 2.1224 4.9999 3.6083 2.4853 5.0515 2.5429 3.2757 3.1162 4.5126 3.2057 5.1035 3.8165 2.0840 1.4089 2.0071 1.1339 1.2948 5.3593 1.2723 2.6142 1.8258 1.7957 1.9832 1.6831 1.3827 2.1964 4.8762 2.1874 1.6634 1.4757 2.4708 1.7785 1.6416 1.7777 1.3642 1.8004 2.1683 3.6130 2.8010 2.3301 2.9938 2.1418 2.5038 1.9728 2.4888 1.8361 1.2591 2.1087 1.8751 1.9427 1.7606 1.4678 1.7469 2.1111 2.3119 1.2680 1.9054 1.3324 1.3380 1.5867 1.3017 1.3458 1.4003 1.2277 1.1218 1.2371 1.7861 1.3395 1.3102 1.4659 1.8633 1.6314 1.5835 1.5417 1.3385 1.3194 1.7807 1.5674 1.2156 1.2147 2.9929 1.7259 2.0433 1.4630 1.1188 1.1445 1.4122 1.1941 1.6069 1.0792 1.2136 1.1188 1.1548 1.0676 1.0612 1.1164 1.0565 1.0780 1.0803 1.0785 3.2312 5.4138 6.2655 6.5715 1.0712 1.0712 1.0706 1.0643 1.0328 1.0582 1.0594 1.0397 1.0606 1.0576 1.0414 1.0708 1.0889 1.0932 1.0944 1.0905 1.0923 1.0913 1.1008 1.0995 1.1038 1.0955 1.0990 1.1004 1.1005 1.0993 1.0994 1.0871 1.0913 1.0947 1.0967 1.0901 1.0759
irintensity: 0.0334 0.0610 0.0297 0.0047 0.0700 0.0945 1.6581 2.8171 0.9478 2.2132 0.3158 0.8955 4.6205 0.6250 4.8048 1.3662 1.9991 1.8406 2.6296 0.4765 0.6595 1.3857 0.0579 3.0340 1.2348 1.4522 1.7207 3.0087 2.2827 3.0608 1.7403 0.7725 5.9937 2.6047 4.1653 6.3545 3.0990 1.1304 2.4903 4.7882 1.6723 2.9060 23.0364 32.4065 73.5949 6.9032 12.0043 19.8954 2.0173 20.8422 25.9899 0.6704 0.4743 0.9146 2.4815 2.7456 85.8194 8.2003 8.3932 0.1615 3.2899 1.4393 17.6194 13.7074 6.7798 1.3951 1.3992 6.3003 36.5537 6.6473 4.7848 5.2604 8.8004 15.6032 20.5731 11.6465 5.5660 0.4956 3.9224 27.6462 10.6791 24.9646 34.8590 93.1910 29.6940 7.3164 25.2928 18.0987 0.5538 6.6603 48.8007 18.0181 9.9471 7.5598 5.6893 1.2185 4.1392 12.4666 0.8535 6.7636 2.7755 29.3749 0.8874 10.1314 4.2822 4.2506 4.3532 0.4576 2.4322 4.1469 12.0547 48.7178 94.3104 2.3138 21.4321 15.4603 8.8596 25.7753 12.6263 31.3585 15.3346 29.7161 6.9154 35.1706 12.8306 9.5042 25.8813 7.5622 11.8353 44.2856 30.7950 119.2550 200.7969 135.5999 244.0209 47.0554 27.8349 242.4425 59.2333 64.7360 24.2678 10.3517 25.8047 57.2385 89.5345 38.1617 20.2072 61.6327 6.5827 1.6835 17.1540 25.7878 14.3074 36.6105 67.0898 57.0427 71.7786 48.2431 94.7657 60.6769 65.3240 29.1743 5.6449 19.4876 16.4434 30.1547 9.8877 46.4516
temp: 298.150 k
press: 1.00000 atm
elementType: 8 7 7 7 6 6 6 6 6 6 6 6 6 6 6 6 6 6 6 6 6 6 6 6 6 1 1 1 1 1 1 1 1 1 1 1 1 1 1 1 1 1 1 1 1 1 1 1 1 1 1 1 1 1 1 1 1 1
symmnumber: 1
zpe: 1323397.4 jmol-1
zpe.correction: 0.504055 hartree
zpe.thermalcorrener: 0.531160 hartree
zpe.thermalcorrenthalpy: 0.532104 hartree
zpe.thermalcorrgfe: 0.443848 hartree
zpe.sumelectzpe: -1057.561618 hartree
zpe.sumelectthermal: -1057.534513 hartree
zpe.sumelectthermalent: -1057.533569 hartree
zpe.sumelectthermalfe: -1057.621825 hartree
dipole: 2.6347 -0.5615 -0.3558
dipole: 2.7172
quadrupole: -147.6431 -146.2345 -153.6210
quadrupole: 3.2795 -5.0556 -2.3095
quadrupole: 1.5231 2.9317 -4.4548 3.2795 -5.0556 -2.3095
hfenergy: -1058.065673 hartree
pointgroup: C01 [X(C21H33N3O1)]
dipole: 1.049956 -0.117369 0.1632997 debye
polarizability: 304.2352709|-43.2984342|262.0138001|13.0912335|56.5756661|231.8815582 unknown
InChI: InChI=1S/C21H33N3O/c1-4-6-13-24(14-7-5-2)15-9-12-22-20-17-19(25-3)16-18-10-8-11-23-21(18)20/h8,10-11,16-17,22H,4-7,9,12-15H2,1-3H3
charge 0 multiplicity 1
58 atoms
O  -3.054724 -2.146725 -1.761172
N  3.272238 0.864208 0.458316
N  -0.438749 0.2907 1.663244
N  -2.507191 1.988208 2.000293
C  2.494239 1.328683 1.637727
C  3.219836 1.827185 -0.678384
C  4.66196 0.462739 0.812663
C  1.898983 0.155403 2.451583
C  1.9349 1.694452 -1.527411
C  5.245238 -0.618699 -0.124745
C  0.752234 -0.559039 1.709637
C  1.897628 0.39974 -2.369781
C  4.545074 -1.988375 0.015003
C  0.576877 0.226565 -3.149441
C  5.070649 -3.037421 -0.987728
C  -1.555233 0.062542 0.889809
C  -2.667231 0.985545 1.06427
C  -1.67672 -0.99096 -0.042914
C  -3.866071 0.817614 0.27451
C  -2.873818 -1.126107 -0.811425
C  -3.95779 -0.245772 -0.667736
C  -4.916927 1.770619 0.503936
C  -4.746888 2.784178 1.45053
C  -3.520647 2.858918 2.183985
C  -1.95453 -3.08518 -1.988843
H  3.118549 1.968895 2.309181
H  1.664165 1.964555 1.27854
H  4.092743 1.63556 -1.331253
H  3.324759 2.878895 -0.312315
H  4.651368 0.060131 1.844274
H  5.342049 1.351669 0.830377
H  1.534527 0.530916 3.430666
H  2.692043 -0.583702 2.671985
H  1.861067 2.574843 -2.199541
H  1.044729 1.728772 -0.867095
H  6.327589 -0.730346 0.095627
H  5.174962 -0.277993 -1.177813
H  0.524214 -1.530117 2.202801
H  1.100286 -0.782401 0.680376
H  2.751548 0.405332 -3.079355
H  2.058769 -0.462723 -1.693184
H  4.684207 -2.362174 1.051042
H  3.456553 -1.839766 -0.123589
H  -0.550225 1.066151 2.328193
H  0.404981 1.076496 -3.837142
H  -0.285992 0.177425 -2.458825
H  0.583125 -0.698231 -3.757547
H  4.565824 -4.01254 -0.856869
H  4.901394 -2.706654 -2.030148
H  6.158016 -3.201315 -0.861818
H  -0.853886 -1.698449 -0.16749
H  -4.853723 -0.390413 -1.277929
H  -5.84709 1.68943 -0.07037
H  -5.535376 3.519502 1.64068
H  -3.365514 3.643104 2.933885
H  -1.044974 -2.56332 -2.344633
H  -1.718726 -3.664167 -1.07461
H  -2.319997 -3.766591 -2.771528
