program: Gaussian 09
title: 000221032
version: EM64L-G09RevD.01
frameworkgroup: C1[X(C13H8Br2O3)]
method: RPBEPBE
basis: SDD
operation: Freq
keyword: #p
keyword: freq=noraman
keyword: PBEPBE/SDD
title: #p freq=noraman PBEPBE/SDD
converged: NO YES NO NO
title: Mulliken charges:
elementType: Br Br O O O C C C C C C C C C C C C C H H H H H H H H
charge: 0.057856 0.013844 -0.387745 -0.329896 -0.400079 0.155308 0.317162 0.109698 0.129479 -0.315834 -0.337091 -0.266850 -0.402364 -0.369177 -0.347504 0.420227 -0.271004 -0.154218 0.295994 0.275773 0.289719 0.234563 0.266751 0.256941 0.388201 0.370246
chargesum: 0.00000
title: Mulliken charges with hydrogens summed into heavy atoms:
elementType: Br Br O O O C C C C C C C C C C C C C
charge: 0.057856 0.013844 0.000456 -0.329896 -0.029833 0.155308 0.317162 0.109698 0.129479 -0.019840 -0.061318 0.022869 -0.402364 -0.134614 -0.080754 0.420227 -0.271004 0.102723
polarizability: 2.72107122e+02 7.34051954e+00 2.29120033e+02 -3.17945786e+01 6.71103266e+00 9.61478453e+01
1716.lowfreq: -7.7206 -4.0246 0.0005 0.0005 0.0006 2.3087 27.4116 36.8222 42.7129
frequency: 27.4061 36.8196 42.7103 98.3599 117.0147 133.3663 147.3020 170.0324 212.7601 238.8774 250.2999 269.0956 295.6534 318.8959 332.0167 392.6670 411.4456 429.3703 446.1694 454.3200 468.6803 506.8215 525.1835 571.8064 610.0656 627.6703 665.7560 686.6906 715.1140 736.2039 767.6945 797.5413 819.0202 829.1177 836.6853 891.6500 933.0975 938.0390 945.1147 956.8321 965.4412 1025.9417 1069.0997 1112.2579 1117.6686 1158.7663 1166.6521 1233.7008 1259.0362 1270.2420 1276.0542 1304.3688 1334.6494 1368.6000 1387.3003 1395.0307 1406.5466 1455.0373 1494.1429 1517.0254 1563.3770 1563.6970 1609.5953 1621.8652 2751.7880 3126.9700 3162.3568 3168.2995 3172.9830 3176.3171 3184.2117 3574.8490
redmass: 12.3574 17.3885 6.6330 8.4044 9.0330 7.3629 7.9036 6.4787 7.6991 7.7274 7.6274 14.8883 7.5511 7.1374 6.4521 1.1340 10.0710 3.8081 3.5390 5.0124 5.3540 4.8843 3.4932 4.5833 8.3059 7.1432 6.5196 5.4818 5.6032 5.3650 3.5064 5.8918 1.6182 1.5828 6.7398 1.5263 1.3654 4.1818 1.1081 1.3935 1.3387 3.2198 2.2389 1.8519 1.6911 1.8849 1.2079 1.4758 2.2913 2.5935 1.8558 1.6097 4.2012 4.0312 4.2801 7.1409 6.0020 2.3640 3.0839 4.8049 6.4072 3.7749 6.7591 5.1270 1.0702 1.0902 1.0891 1.0923 1.0947 1.0923 1.0973 1.0661
irintensity: 0.8112 0.2400 1.1258 1.3346 0.8572 0.8709 0.5391 2.2667 5.3181 1.4652 1.3259 1.9291 5.0727 4.1469 5.2455 141.1436 8.3722 9.1336 1.9638 3.7629 7.3732 0.5551 19.6609 22.6820 23.7247 35.2862 34.5371 13.8740 21.6090 14.2010 9.8207 6.6022 43.3647 51.7002 22.9851 25.4186 4.7481 22.8598 130.3899 11.9285 0.1430 29.6544 11.4859 100.5251 197.8623 28.4105 6.0833 109.6952 413.9397 57.7007 111.4926 107.2414 179.4035 134.9961 66.8287 33.0182 12.2072 259.0957 10.3881 86.3541 10.9789 108.2024 148.8621 70.2514 346.0681 13.4393 0.9739 0.6908 2.0776 0.5126 4.4453 90.8735
temp: 298.150 k
press: 1.00000 atm
elementType: 35 35 8 8 8 6 6 6 6 6 6 6 6 6 6 6 6 6 1 1 1 1 1 1 1 1
symmnumber: 1
zpe: 458452.3 jmol-1
zpe.correction: 0.174615 hartree
zpe.thermalcorrener: 0.190574 hartree
zpe.thermalcorrenthalpy: 0.191519 hartree
zpe.thermalcorrgfe: 0.128419 hartree
zpe.sumelectzpe: -751.521469 hartree
zpe.sumelectthermal: -751.505510 hartree
zpe.sumelectthermalent: -751.504565 hartree
zpe.sumelectthermalfe: -751.567666 hartree
dipole: -2.4506 0.8238 1.9646
dipole: 3.2471
quadrupole: -103.6754 -132.0629 -120.8566
quadrupole: -14.7268 -12.7521 7.7446
quadrupole: 15.1895 -13.1979 -1.9916 -14.7268 -12.7521 7.7446
hfenergy: -751.6960841 hartree
pointgroup: C01 [X(C13H8Br2O3)]
dipole: -1.001262 0.437141 0.6621338 debye
dipolederiv: -0.0355236 -0.0742735 -0.0052794 -0.2531203 -0.5459919 -0.062649 -0.0286403 -0.0911828 -0.0070443 -0.0832978 0.0739761 -0.0364437 0.2363197 -0.4480487 0.2590203 -0.1405776 0.278015 -0.2036671 -0.535311 0.0830023 -0.0823745 -0.0921223 -1.0659799 0.4375972 0.1097131 0.414582 -0.6279595 -0.920133 -0.0250486 0.0306737 -0.0097752 -1.0542301 0.2676346 -0.0560328 0.2671215 -0.4202304 -1.5708342 -0.3178149 0.2915686 -0.5257606 -0.1389316 0.2024854 0.340474 0.1544906 -0.4605858 -1.2273992 0.1189125 0.1144975 0.5156728 -0.3103565 0.0337357 0.0356866 0.1173034 -0.0970102 -0.9442986 -0.2666996 0.1842318 -0.2898386 -0.2231969 0.0799005 0.2081466 0.0760905 -0.0966518 2.4419827 0.0539807 -0.1798422 -0.0805412 0.9034047 -0.2864818 -0.1978135 -0.292628 0.2690275 0.3145508 -0.2952276 0.1534145 0.2460657 0.9440636 -0.5249021 -0.1084716 -0.3990313 0.3609771 0.1343025 0.0309973 -0.0610492 0.249724 -0.1154336 -0.0709497 -0.1910177 -0.0616003 0.0067058 0.4006241 0.0218131 -0.1428643 -0.1372381 0.0329745 0.0486973 -0.0455241 0.017882 -0.0621808 0.2614361 0.0002826 -0.085923 -0.4650433 -0.1184757 0.1454551 0.0746741 0.0796488 -0.0922331 -0.4753515 0.0821596 0.1031365 0.6212059 1.0685634 0.1128233 0.2477968 0.2179454 -0.1713728 -0.2870157 0.001957 0.0194715 -0.5233429 -0.1177387 0.1657653 -0.0639426 0.0119034 -0.158463 0.090632 0.2512861 -0.2227746 -0.0692289 -0.2969 0.089769 -0.0709628 -0.0107634 -0.1527047 1.4499834 0.1810028 -0.3886746 0.445189 -0.0642518 -0.1964473 -0.3973593 -0.1108955 0.2422086 -0.5731141 -0.1887535 0.1961347 -0.3576239 0.7430329 -0.5899086 0.3986531 -0.5769482 0.1872514 0.2330049 0.0495823 -0.1227783 0.2777361 -0.0579959 -0.0223068 -0.2870223 0.0170637 -0.0149617 0.0936969 0.0573033 0.0465354 0.0803665 0.0579076 -0.0234169 0.0684621 -0.0175272 0.1030789 0.1273172 -0.046255 0.0097268 -0.0107716 0.00504 -0.0320187 -0.0220457 -0.0014149 0.14993 0.0920476 -0.0363714 0.0685165 -0.0503885 0.0778583 0.0360532 0.0897712 0.0336515 0.0869134 -0.0705854 0.0588392 0.0899121 0.0401673 0.0262616 -0.0426808 0.0849237 -0.0520003 0.1334327 0.0188426 -0.0149203 0.0531744 -0.0349938 0.0655046 0.0805435 0.0708654 0.0606352 0.1132885 -0.0126237 0.0604582 0.0096344 0.080731 0.0939827 0.0152674 0.0019724 0.015948 0.1414663 0.6137527 0.0782343 -0.0404447 0.0043339 0.4330974 -0.0377767 -0.1073863 -0.0816088 0.3953176 0.4633145 0.0615771 -0.0021799 0.1022774 0.1058397 -0.0852095 -0.0143423 -0.0666806 0.3754672 unknown
polarizability: 271.0140398|2.1961763|221.6452867|-32.1160936|-34.5627539|104.7156742 unknown
InChI: InChI=1S/C13H8Br2O3/c14-8-2-4-11(16)9(6-8)13(18)7-1-3-12(17)10(15)5-7/h1-6,16-17H
charge 0 multiplicity 1
26 atoms
Br -3.080255 -3.199268 -0.11963
Br 3.170725 -2.851464 1.420493
O  2.399482 2.370487 -1.736456
O  0.019864 2.458504 -0.931846
O  -4.956443 -1.043821 1.006448
C  1.387206 0.570943 -0.39076
C  -1.201536 0.612116 -0.040098
C  0.077549 1.248819 -0.461233
C  2.508134 1.173665 -1.076991
C  -1.469392 -0.775515 -0.205606
C  -2.232566 1.454982 0.455546
C  1.612718 -0.622823 0.362303
C  -2.723663 -1.303727 0.141792
C  -3.478649 0.924222 0.820194
C  3.771362 0.52528 -1.078632
C  -3.73929 -0.463932 0.669463
C  2.875695 -1.221925 0.367551
C  3.958453 -0.667583 -0.364712
H  -0.722471 -1.436478 -0.652925
H  -2.034946 2.527086 0.544302
H  0.806292 -1.045287 0.966075
H  -4.261509 1.581445 1.218576
H  4.592739 0.991875 -1.628631
H  4.93737 -1.155583 -0.356113
H  1.443261 2.728099 -1.550204
H  -5.597433 -0.370418 1.347191
