program: Gaussian 09
title: 000018796
version: EM64L-G09RevD.01
frameworkgroup: C1[X(C14H14N2O2)]
method: RPBEPBE
basis: SDD
operation: Freq
keyword: #p
keyword: freq=noraman
keyword: PBEPBE/SDD
title: #p freq=noraman PBEPBE/SDD
converged: YES YES NO NO
title: Mulliken charges:
elementType: O O N N C C C C C C C C C C C C C C H H H H H H H H H H H H H H
charge: -0.461063 -0.290711 -0.375910 -0.080183 -0.302531 0.473166 0.136327 -0.378078 -0.453072 0.157609 0.461494 -0.403724 -0.215218 -0.221927 -0.236248 -0.341579 -0.797952 -0.335755 0.239665 0.363185 0.265288 0.244850 0.305576 0.228502 0.230296 0.231118 0.236210 0.371516 0.225708 0.240512 0.242245 0.240681
chargesum: 0.00000
title: Mulliken charges with hydrogens summed into heavy atoms:
elementType: O O N N C C C C C C C C C C C C C C
charge: -0.089547 -0.290711 -0.012725 -0.080183 -0.062866 0.473166 0.136327 -0.112790 -0.208222 0.157609 0.461494 -0.098148 0.013283 0.008369 -0.005130 -0.105369 -0.089486 -0.095073
polarizability: 2.14035681e+02 -8.12934556e+00 1.80102797e+02 2.33024934e+00 1.25819759e+01 1.17907948e+02
1716.lowfreq: -34.4192 -9.1222 -8.1701 -0.0007 -0.0005 -0.0002 3.6505 23.3931 32.3893
frequency: -34.3588 23.3098 32.3220 42.4120 76.2577 88.9599 112.0133 191.9100 195.8756 210.4079 243.1708 287.0725 308.1119 349.3795 394.0032 397.8184 403.2217 448.2429 487.7620 511.0749 533.4844 543.6758 592.0183 607.8749 616.2897 641.1264 705.1762 735.3938 743.6775 757.0320 776.0667 798.5162 835.1303 835.4648 858.2037 909.9520 928.2466 934.4435 935.0580 963.1180 970.0527 979.7616 989.2356 998.9760 1011.3860 1023.4941 1034.5993 1050.4755 1086.8097 1108.5555 1156.3935 1172.5982 1179.0465 1187.3877 1198.3441 1207.8140 1268.1848 1285.9956 1299.8937 1329.4882 1332.7183 1369.7331 1387.7071 1399.2309 1431.0068 1440.8762 1442.1764 1467.3071 1470.7136 1481.8775 1513.6508 1563.3636 1594.5267 1598.2539 1603.7300 1613.2189 2924.9105 2985.3255 3066.5974 3095.8341 3105.1311 3129.1230 3135.2899 3142.4351 3157.5677 3160.9125 3168.5943 3180.0785 3375.4103 3464.3275
redmass: 1.0279 4.6002 4.4233 4.5796 7.0577 6.0652 5.1600 4.8293 4.7787 3.7764 4.7374 4.8054 5.1483 5.3808 5.8585 4.0149 2.8426 2.8293 1.7892 5.6282 2.4393 2.8208 3.7456 6.3847 6.5769 5.1272 1.9246 1.9692 2.2957 5.6439 1.6284 3.3938 1.5128 2.7969 1.2699 3.1411 2.7069 1.6625 1.5498 1.4039 5.9337 1.3823 6.0237 1.3389 1.6698 2.5316 3.3423 1.5823 1.6902 1.5610 2.0119 1.0956 1.4251 1.3703 1.5746 1.7285 2.2584 1.4010 1.5282 2.1052 1.9073 1.6075 5.9393 1.2213 4.1045 2.1465 2.2170 1.0847 1.0868 2.3175 2.2125 5.5368 6.1169 5.0077 8.8511 6.2414 1.0818 1.0376 1.0969 1.0995 1.0887 1.0861 1.0882 1.0916 1.0957 1.0976 1.1002 1.0940 1.0638 1.0761
irintensity: 0.7227 0.7801 0.2935 0.0662 0.7625 1.1267 1.9725 5.5452 7.3525 0.6287 2.1690 7.5633 3.4231 36.6361 9.1452 1.0295 0.1862 12.6152 35.9396 3.8962 80.7399 32.2940 2.0511 8.8961 1.8958 7.6276 49.5284 36.7914 32.5688 3.3274 35.6933 13.6138 42.2262 11.6086 1.4085 24.2998 6.6529 24.1224 22.5340 0.9524 1.3451 0.7025 0.4064 1.4853 2.8927 17.3962 61.6689 17.9200 10.2640 4.8200 5.9020 6.3722 51.9447 50.8656 5.9223 8.7097 23.5105 21.0943 31.1348 15.7030 28.3732 212.2291 3.2873 22.6254 106.7191 13.6910 13.4066 33.8158 26.5936 18.5140 457.5114 129.8987 1.8814 82.6249 161.1908 9.5157 34.7621 18.7844 14.5027 20.3351 11.4174 0.6603 9.1150 21.0914 21.3500 26.9604 16.0069 4.6680 77.9092 71.0644
temp: 298.150 k
press: 1.00000 atm
elementType: 8 8 7 7 6 6 6 6 6 6 6 6 6 6 6 6 6 6 1 1 1 1 1 1 1 1 1 1 1 1 1 1
symmnumber: 1
zpe: 660299.1 jmol-1
zpe.correction: 0.251495 hartree
zpe.thermalcorrener: 0.266816 hartree
zpe.thermalcorrenthalpy: 0.267760 hartree
zpe.thermalcorrgfe: 0.206843 hartree
zpe.sumelectzpe: -800.572757 hartree
zpe.sumelectthermal: -800.557436 hartree
zpe.sumelectthermalent: -800.556491 hartree
zpe.sumelectthermalfe: -800.617409 hartree
dipole: -2.8315 -2.4939 0.2166
dipole: 3.7794
quadrupole: -90.7420 -108.6873 -101.1059
quadrupole: -8.9878 0.3659 2.0080
quadrupole: 9.4364 -8.5089 -0.9275 -8.9878 0.3659 2.0080
hfenergy: -800.8242519 hartree
pointgroup: C01 [X(C14H14N2O2)]
dipole: 1.1346794 -0.8624697 -0.4238044 debye
polarizability: 212.9209355|9.5046178|183.4086007|-5.0525546|2.6503812|115.7168904 unknown
InChI: InChI=1S/C14H14N2O2/c1-10-7-8-15-12(9-10)16-14(18)13(17)11-5-3-2-4-6-11/h2-9,13,16-17H,1H3
charge 0 multiplicity 1
32 atoms
O  -2.229764 2.496581 1.168312
O  0.310758 2.360688 0.463023
N  0.384566 0.011885 0.409502
N  1.962849 -1.584157 -0.15438
C  -1.67378 1.15957 1.238917
C  -2.567961 0.150939 0.526582
C  -0.224826 1.220573 0.647778
C  -3.235195 0.509632 -0.669966
C  -2.718286 -1.16081 1.041618
C  1.709657 -0.245838 -0.031084
C  3.953105 0.378679 -0.738426
C  2.659252 0.766471 -0.309378
C  -4.026488 -0.439585 -1.351535
C  -3.50732 -2.113147 0.355666
C  -4.159559 -1.755422 -0.845826
C  4.224267 -1.007764 -0.870127
C  5.006622 1.426572 -1.037204
C  3.207736 -1.941979 -0.570558
H  -1.55825 0.85337 2.303432
H  -0.174572 -0.844348 0.513285
H  -3.147782 1.5378 -1.035133
H  -2.245037 -1.434132 1.994583
H  2.37909 1.816025 -0.195676
H  -4.544377 -0.154643 -2.274284
H  -3.620619 -3.123573 0.763671
H  -4.775381 -2.489679 -1.376906
H  5.207344 -1.356833 -1.201683
H  -1.460857 3.108933 0.969727
H  5.911985 0.979056 -1.480408
H  4.620991 2.190781 -1.735981
H  5.306611 1.956219 -0.113523
H  3.38622 -3.018665 -0.665022
